{"text_format":"3","workbook":"xlsx","n_sheets":7,"sheets":["Initial","Report 70°C","Report 100°C","Report 130°C","Report 160°C","Report Other","Def"],"not_rendered":{"charts":5,"images":1,"defined_names":31},"read":"whole","date_system":"1900"}

{"sheet":"Initial","index":0,"n_rows":29,"n_cols":17,"rows_kept":29,"merged":[[0,1,0,2],[0,10,0,11],[1,1,1,2],[2,7,2,8],[2,9,2,10],[3,1,3,4],[4,1,4,2],[4,3,4,4],[4,6,8,6],[4,7,4,8],[5,1,5,2],[5,3,5,4],[5,7,5,8],[6,1,6,2],[6,3,6,4],[6,7,6,8],[7,1,7,2],[7,3,7,4],[7,7,7,8],[8,1,8,2],[8,3,8,4]]}
[null,"SmartCalTM",{"$nulls":4},{"$f":"Def!$B$4","v":"Initial data"},{"$nulls":3},"English",{"$nulls":3},{"$f":"TRANSPOSE(Def!$C$1:$P$1)","v":"English"},"Selected Language"]
[null,{"$f":"Def!$B$68","v":"Version 2.10   2012-03"},{"$nulls":12},"Deutsch",{"$f":"MATCH($K$1,$O$1:$O$10,0)","v":1}]
[{"$nulls":7},"Control Limits:",null,"MT Control Limits (certified)",{"$nulls":4},"Français","Selected Temperature"]
[null,{"$f":"Def!$B$10","v":"Instrument identification"},{"$nulls":12},"Italiano",{"$f":"MATCH($J$5,$P$25:$P$29,0)","v":2}]
[null,{"$f":"Def!$B$11","v":"Company"},{"$nulls":5},{"$f":"Def!$B$9","v":"Test temperature"},null,"100°C",{"$f":"IF($J$5=$P$29,\">>>>\",\"\")","v":""},{"$nulls":3},"Español",{"$f":"IF($P$4<5,$J$5,$L$5)","v":"100°C"}]
[null,{"$f":"Def!$B$12","v":"Instrument type"},{"$nulls":5},{"$f":"Def!$B$17","v":"Switch-off criterion"},null,{"$f":"Def!$B$18","v":"Time (10 min)"},{"$nulls":4},"Português",{"$f":"IF($J$5=$P$29,\"-----\",Def!$B$54:$B$55)","v":"MT Control Limits (certified)"},{"$f":"Def!$B$54:$B$57","v":"MT Control Limits (certified)"}]
[null,{"$f":"Def!$B$13","v":"Instrument ID"},{"$nulls":5},{"$f":"Def!$B$19","v":"Drying program"},null,{"$f":"Def!$B$20","v":"Standard"},{"$nulls":4},"Русский (Russian)","MT Control Limits (standard)","MT Control Limits (standard)"]
[null,{"$f":"Def!$B$14","v":"Location"},{"$nulls":5},{"$f":"Def!$B$21","v":"Display mode"},null,{"$f":"Def!$B$36","v":"%MC"},{"$nulls":4},"中文 (Chinese)",{"$f":"Def!$B$57","v":"Manual input limits"},"- - - - - -"]
[null,{"$f":"Def!$B$15","v":"Contact Person"},{"$nulls":12},"日本語  (Japanese)",null,"Manual input limits"]
[{"$nulls":14},"한국어  (Korean)","Patched Control Limits","Selected Control Limits"]
[{"$nulls":14},0,{"$f":"IF($Q$11=\"\",\"\",IF($Q$11=4,3,IF($Q$11=3,4,$Q$11)))","v":1},{"$f":"IF(ISERROR(MATCH($J$3,$P$6:$P$9,0)),\"\",MATCH($J$3,$P6:$P$9,0))","v":1}]
[{"$nulls":14},0,"All header information?"]
[{"$nulls":14},"TODAY",{"$f":"COUNTA($D$5:$D$9)=5","v":false}]
[{"$nulls":14},{"$f":"TODAY()","v":"2012-10-23"},{"$f":"AND($P$13,COUNTA($B14:$G14)=5)","v":false},{"$f":"CorrMC2","v":{"v":-0.3981778275591398,"d":"-0.40"}}]
[{"$nulls":15},false,{"v":-0.3981778275591398,"d":"-0.40"}]
[{"$nulls":15},false,{"v":-0.3981778275591398,"d":"-0.40"}]
[{"$nulls":15},false,{"v":-0.3981778275591398,"d":"-0.40"}]
[{"$nulls":15},false,{"v":-0.3981778275591398,"d":"-0.40"}]
[{"$nulls":15},false,{"v":-0.3981778275591398,"d":"-0.40"}]
[{"$nulls":15},false,{"v":-0.3981778275591398,"d":"-0.40"}]
{"$rows_left_out":10}
{"sheet":"Report 70°C","index":1,"n_rows":72,"n_cols":24,"rows_kept":72,"merged":[[0,1,1,2],[0,3,1,9],[2,3,2,9],[2,19,3,19],[2,20,3,20],[2,21,3,22],[3,8,3,14],[5,1,5,4],[5,7,5,8],[5,10,5,13],[5,14,5,15],[6,11,6,13],[7,11,7,13],[8,12,9,14],[10,7,10,9],[10,12,15,14],[11,7,12,9],[19,13,20,14],[21,13,24,14],[25,13,26,14],[36,1,38,5],[36,7,38,11],[40,1,41,2],[40,3,41,9],[40,10,41,14],[43,1,45,1],[43,2,45,2],[43,3,43,4],[43,5,43,7],[43,8,43,12],[43,13,45,14],[44,3,45,3],[44,4,45,4],[44,5,45,5],[44,6,45,6],[44,7,45,7],[44,8,45,12],[44,19,45,19],[44,20,45,20],[44,21,45,21],[44,22,44,23],[46,8,46,12],[46,13,46,14],[47,8,47,12],[47,13,47,14],[48,8,48,12],[48,13,48,14],[49,8,49,12],[49,13,49,14],[50,8,50,12],[50,13,50,14],[51,8,51,12],[51,13,51,14],[52,8,52,12],[52,13,52,14],[53,8,53,12],[53,13,53,14],[54,8,54,12],[54,13,54,14],[55,8,55,12],[55,13,55,14],[56,8,56,12],[56,13,56,14],[57,8,57,12],[57,13,57,14],[58,8,58,12],[58,13,58,14],[59,8,59,12],[59,13,59,14],[60,8,60,12],[60,13,60,14],[61,8,61,12],[61,13,61,14],[62,8,62,12],[62,13,62,14],[63,8,63,12],[63,13,63,14],[64,8,64,12],[64,13,64,14],[65,8,65,12],[65,13,65,14],[66,8,66,12],[66,13,66,14],[67,8,67,12],[67,13,67,14],[68,8,68,12],[68,13,68,14],[69,8,69,12],[69,13,69,14],[71,1,71,4],[71,6,71,10],[72,1,74,4],[72,6,74,11]]}
[null,"SmartCalTM",null,{"$f":"Def!$B$6","v":"Performance test for Moisture Analyzer"}]
[{"$nulls":17},"Are D7 to D11 complete?"]
[null,{"$f":"Def!$B$68","v":"Version 2.10   2012-03"},null,{"$f":"$R$33","v":"Test temperature 70°C"},{"$nulls":13},{"$f":"(OR(AND(OR($T$5=1,$T$5=2,$T$5=3),$S$3+COUNTA($O$7:$O$8)=5),AND($T$5=4,COUNT($O$7:$O$8)=2,$S$3=5)))","v":false},{"$f":"COUNTA(Initial!D5:E9)","v":0},"Control limits Source","Selected Language","Selected Temperature"]
[{"$nulls":17},"Temperature number"]
[{"$nulls":14},{"$f":"IF($T$5=\"\",\"\",IF(AND(OR($T$5<4,$T$5>4),COUNTA($O$7:$O$8)>0),Def!$B$73,\"\"))","v":""},null,null,1,null,{"$f":"Initial!$P$11","v":1},{"$f":"Initial!$P$2","v":1},{"$f":"Initial!$P$5","v":"100°C"},{"$f":"Initial!$P$4","v":2}]
[null,{"$f":"Def!$B$10","v":"Instrument identification"},{"$nulls":5},{"$f":"Def!$B$16","v":"Testing parameter"},null,null,{"$f":"IF(OR($T$5=1,$T$5=2),Def!$B$24,\"\")","v":"MT Control Limits [%MC]"},{"$nulls":3},{"$f":"IF($T$5=1,Def!$B$63,IF($T$5=2,Def!$B$20,IF($T$5=4,Def!$B$64,\"\")))","v":"Certified"},null,null,{"$f":"Def!$B$39","v":"Yes"}]
[null,null,{"$f":"Def!$B$11:$B$15","v":"Company"},{"$f":"IF(Initial!$D$5:$D$9=\"\",\"\",Initial!$D$5:$D$9)","v":""},{"$nulls":4},{"$f":"Def!$B$17","v":"Switch-off criterion"},{"$f":"Initial!$J$6:$J$8","v":"Time (10 min)"},null,{"$f":"IF($O$5>\"\",\"\",Def!$B$25&\"   \"&IF($T$5=1,TEXT($S$39,\"0.0\"),IF($T$5=2,TEXT($S$38,\"0.0\"),IF($T$5=3,IF($W$5=$R$5,TEXT(Initial!$L$19,\"0.0\"),\"\"),\"\"))))","v":"Lower Limit   3.3"},{"$nulls":5},{"$f":"Def!$B$40","v":"No"}]
[null,null,"Instrument type","",{"$nulls":4},{"$f":"Def!$B$19","v":"Drying program"},"Standard",null,{"$f":"IF($O$5>\"\",\"\",Def!$B$26&\"   \"&IF($T$5=1,TEXT($S$37,\"0.0\"),IF($T$5=2,TEXT($S$36,\"0.0\"),IF($T$5=3,IF($W$5=$R$5,TEXT(Initial!$L$20,\"0.0\"),\"\"),\"\"))))","v":"Upper Limit   4.3"}]
[null,null,"Instrument ID","",{"$nulls":4},{"$f":"Def!$B$21","v":"Display mode"},"%MC",null,null,{"$f":"IF($T$5=\"\",\"\",IF(AND($I$4=$R$12,$O$7>0,$O$8>0,$O$8<$O$7),Def!$B$74,\"\"))","v":""},{"$nulls":4},"************"]
[null,null,"Location",""]
[null,null,"Contact Person","",{"$nulls":3},"Perform test with cold instrument."]
[]
[]
[{"$nulls":17},{"$f":"\"Control Limits: \"&IF(OR($T$5=1,$T$5=2),Def!$B$23,IF($T$5=4,Def!$B$57,\"\"))","v":"Control Limits: MT Control Limits"}]
[]
[]
[{"$nulls":17},"************"]
[]
[]
[{"$nulls":13},{"$f":"Def!$B$29","v":"Test Results %MCN"}]
{"$rows_left_out":53}
{"sheet":"Report 100°C","index":2,"n_rows":72,"n_cols":24,"rows_kept":72,"merged":[[0,1,1,2],[0,3,1,9],[2,3,2,9],[2,19,3,19],[2,20,3,20],[2,21,3,22],[3,8,3,14],[5,1,5,4],[5,7,5,8],[5,10,5,13],[5,14,5,15],[6,11,6,13],[7,11,7,13],[8,12,9,14],[10,7,10,9],[10,12,15,14],[11,7,12,9],[19,13,20,14],[21,13,24,14],[25,13,26,14],[36,1,38,5],[36,7,38,11],[40,1,41,2],[40,3,41,9],[40,10,41,14],[43,1,45,1],[43,2,45,2],[43,3,43,4],[43,5,43,7],[43,8,43,12],[43,13,45,14],[44,3,45,3],[44,4,45,4],[44,5,45,5],[44,6,45,6],[44,7,45,7],[44,8,45,12],[44,19,45,19],[44,20,45,20],[44,21,45,21],[44,22,44,23],[46,8,46,12],[46,13,46,14],[47,8,47,12],[47,13,47,14],[48,8,48,12],[48,13,48,14],[49,8,49,12],[49,13,49,14],[50,8,50,12],[50,13,50,14],[51,8,51,12],[51,13,51,14],[52,8,52,12],[52,13,52,14],[53,8,53,12],[53,13,53,14],[54,8,54,12],[54,13,54,14],[55,8,55,12],[55,13,55,14],[56,8,56,12],[56,13,56,14],[57,8,57,12],[57,13,57,14],[58,8,58,12],[58,13,58,14],[59,8,59,12],[59,13,59,14],[60,8,60,12],[60,13,60,14],[61,8,61,12],[61,13,61,14],[62,8,62,12],[62,13,62,14],[63,8,63,12],[63,13,63,14],[64,8,64,12],[64,13,64,14],[65,8,65,12],[65,13,65,14],[66,8,66,12],[66,13,66,14],[67,8,67,12],[67,13,67,14],[68,8,68,12],[68,13,68,14],[69,8,69,12],[69,13,69,14],[71,1,71,4],[71,6,71,10],[72,1,74,4],[72,6,74,11]]}
[null,"SmartCalTM",null,{"$f":"Def!$B$6","v":"Performance test for Moisture Analyzer"}]
[{"$nulls":17},"Are D7 to D11 complete?"]
[null,{"$f":"Def!$B$68","v":"Version 2.10   2012-03"},null,{"$f":"$R$33","v":"Test temperature 100°C"},{"$nulls":13},{"$f":"(OR(AND(OR($T$5=1,$T$5=2,$T$5=3),$S$3+COUNTA($O$7:$O$8)=5),AND($T$5=4,COUNT($O$7:$O$8)=2,$S$3=5)))","v":false},{"$f":"COUNTA(Initial!D5:E9)","v":0},"Control limits Source","Selected Language","Selected Temperature"]
[{"$nulls":17},"Temperature number"]
[{"$nulls":14},{"$f":"IF($T$5=\"\",\"\",IF(AND(OR($T$5<4,$T$5>4),COUNTA($O$7:$O$8)>0),Def!$B$73,\"\"))","v":""},null,null,2,null,{"$f":"Initial!$P$11","v":1},{"$f":"Initial!$P$2","v":1},{"$f":"Initial!$P$5","v":"100°C"},{"$f":"Initial!$P$4","v":2}]
[null,{"$f":"Def!$B$10","v":"Instrument identification"},{"$nulls":5},{"$f":"Def!$B$16","v":"Testing parameter"},null,null,{"$f":"IF(OR($T$5=1,$T$5=2),Def!$B$24,\"\")","v":"MT Control Limits [%MC]"},{"$nulls":3},{"$f":"IF($T$5=1,Def!$B$63,IF($T$5=2,Def!$B$20,IF($T$5=4,Def!$B$64,\"\")))","v":"Certified"},null,null,{"$f":"Def!$B$39","v":"Yes"}]
[null,null,{"$f":"Def!$B$11:$B$15","v":"Company"},{"$f":"IF(Initial!$D$5:$D$9=\"\",\"\",Initial!$D$5:$D$9)","v":""},{"$nulls":4},{"$f":"Def!$B$17","v":"Switch-off criterion"},{"$f":"Initial!$J$6:$J$8","v":"Time (10 min)"},null,{"$f":"IF($O$5>\"\",\"\",Def!$B$25&\"   \"&IF($T$5=1,TEXT($S$39,\"0.0\"),IF($T$5=2,TEXT($S$38,\"0.0\"),IF($T$5=3,IF($W$5=$R$5,TEXT(Initial!$L$19,\"0.0\"),\"\"),\"\"))))","v":"Lower Limit   5.3"},{"$nulls":5},{"$f":"Def!$B$40","v":"No"}]
[null,null,"Instrument type","",{"$nulls":4},{"$f":"Def!$B$19","v":"Drying program"},"Standard",null,{"$f":"IF($O$5>\"\",\"\",Def!$B$26&\"   \"&IF($T$5=1,TEXT($S$37,\"0.0\"),IF($T$5=2,TEXT($S$36,\"0.0\"),IF($T$5=3,IF($W$5=$R$5,TEXT(Initial!$L$20,\"0.0\"),\"\"),\"\"))))","v":"Upper Limit   6.3"}]
[null,null,"Instrument ID","",{"$nulls":4},{"$f":"Def!$B$21","v":"Display mode"},"%MC",null,null,{"$f":"IF($T$5=\"\",\"\",IF(AND($I$4=$R$12,$O$7>0,$O$8>0,$O$8<$O$7),Def!$B$74,\"\"))","v":""},{"$nulls":4},"************"]
[null,null,"Location",""]
[null,null,"Contact Person","",{"$nulls":3},"Perform test with cold instrument."]
[]
[]
[{"$nulls":17},{"$f":"\"Control Limits: \"&IF(OR($T$5=1,$T$5=2),Def!$B$23,IF($T$5=4,Def!$B$57,\"\"))","v":"Control Limits: MT Control Limits"}]
[]
[]
[{"$nulls":17},"************"]
[]
[]
[{"$nulls":13},{"$f":"Def!$B$29","v":"Test Results %MCN"}]
{"$rows_left_out":53}
{"sheet":"Report 130°C","index":3,"n_rows":72,"n_cols":24,"rows_kept":72,"merged":[[0,1,1,2],[0,3,1,9],[2,3,2,9],[2,19,3,19],[2,20,3,20],[2,21,3,22],[3,8,3,14],[5,1,5,4],[5,7,5,8],[5,10,5,13],[5,14,5,15],[6,11,6,13],[7,11,7,13],[8,12,9,14],[10,7,10,9],[10,12,15,14],[11,7,12,9],[19,13,20,14],[21,13,24,14],[25,13,26,14],[36,1,38,5],[36,7,38,11],[40,1,41,2],[40,3,41,9],[40,10,41,14],[43,1,45,1],[43,2,45,2],[43,3,43,4],[43,5,43,7],[43,8,43,12],[43,13,45,14],[44,3,45,3],[44,4,45,4],[44,5,45,5],[44,6,45,6],[44,7,45,7],[44,8,45,12],[44,19,45,19],[44,20,45,20],[44,21,45,21],[44,22,44,23],[46,8,46,12],[46,13,46,14],[47,8,47,12],[47,13,47,14],[48,8,48,12],[48,13,48,14],[49,8,49,12],[49,13,49,14],[50,8,50,12],[50,13,50,14],[51,8,51,12],[51,13,51,14],[52,8,52,12],[52,13,52,14],[53,8,53,12],[53,13,53,14],[54,8,54,12],[54,13,54,14],[55,8,55,12],[55,13,55,14],[56,8,56,12],[56,13,56,14],[57,8,57,12],[57,13,57,14],[58,8,58,12],[58,13,58,14],[59,8,59,12],[59,13,59,14],[60,8,60,12],[60,13,60,14],[61,8,61,12],[61,13,61,14],[62,8,62,12],[62,13,62,14],[63,8,63,12],[63,13,63,14],[64,8,64,12],[64,13,64,14],[65,8,65,12],[65,13,65,14],[66,8,66,12],[66,13,66,14],[67,8,67,12],[67,13,67,14],[68,8,68,12],[68,13,68,14],[69,8,69,12],[69,13,69,14],[71,1,71,4],[71,6,71,10],[72,1,74,4],[72,6,74,11]]}
[null,"SmartCalTM",null,{"$f":"Def!$B$6","v":"Performance test for Moisture Analyzer"}]
[{"$nulls":17},"Are D7 to D11 complete?"]
[null,{"$f":"Def!$B$68","v":"Version 2.10   2012-03"},null,{"$f":"$R$33","v":"Test temperature 130°C"},{"$nulls":13},{"$f":"(OR(AND(OR($T$5=1,$T$5=2,$T$5=3),$S$3+COUNTA($O$7:$O$8)=5),AND($T$5=4,COUNT($O$7:$O$8)=2,$S$3=5)))","v":false},{"$f":"COUNTA(Initial!D5:E9)","v":0},"Control limits Source","Selected Language","Selected Temperature"]
[{"$nulls":17},"Temperature number"]
[{"$nulls":14},{"$f":"IF($T$5=\"\",\"\",IF(AND(OR($T$5<4,$T$5>4),COUNTA($O$7:$O$8)>0),Def!$B$73,\"\"))","v":""},null,null,3,null,{"$f":"Initial!$P$11","v":1},{"$f":"Initial!$P$2","v":1},{"$f":"Initial!$P$5","v":"100°C"},{"$f":"Initial!$P$4","v":2}]
[null,{"$f":"Def!$B$10","v":"Instrument identification"},{"$nulls":5},{"$f":"Def!$B$16","v":"Testing parameter"},null,null,{"$f":"IF(OR($T$5=1,$T$5=2),Def!$B$24,\"\")","v":"MT Control Limits [%MC]"},{"$nulls":3},{"$f":"IF($T$5=1,Def!$B$63,IF($T$5=2,Def!$B$20,IF($T$5=4,Def!$B$64,\"\")))","v":"Certified"},null,null,{"$f":"Def!$B$39","v":"Yes"}]
[null,null,{"$f":"Def!$B$11:$B$15","v":"Company"},{"$f":"IF(Initial!$D$5:$D$9=\"\",\"\",Initial!$D$5:$D$9)","v":""},{"$nulls":4},{"$f":"Def!$B$17","v":"Switch-off criterion"},{"$f":"Initial!$J$6:$J$8","v":"Time (10 min)"},null,{"$f":"IF($O$5>\"\",\"\",Def!$B$25&\"   \"&IF($T$5=1,TEXT($S$39,\"0.0\"),IF($T$5=2,TEXT($S$38,\"0.0\"),IF($T$5=3,IF($W$5=$R$5,TEXT(Initial!$L$19,\"0.0\"),\"\"),\"\"))))","v":"Lower Limit   7.5"},{"$nulls":5},{"$f":"Def!$B$40","v":"No"}]
[null,null,"Instrument type","",{"$nulls":4},{"$f":"Def!$B$19","v":"Drying program"},"Standard",null,{"$f":"IF($O$5>\"\",\"\",Def!$B$26&\"   \"&IF($T$5=1,TEXT($S$37,\"0.0\"),IF($T$5=2,TEXT($S$36,\"0.0\"),IF($T$5=3,IF($W$5=$R$5,TEXT(Initial!$L$20,\"0.0\"),\"\"),\"\"))))","v":"Upper Limit   8.7"}]
[null,null,"Instrument ID","",{"$nulls":4},{"$f":"Def!$B$21","v":"Display mode"},"%MC",null,null,{"$f":"IF($T$5=\"\",\"\",IF(AND($I$4=$R$12,$O$7>0,$O$8>0,$O$8<$O$7),Def!$B$74,\"\"))","v":""},{"$nulls":4},"************"]
[null,null,"Location",""]
[null,null,"Contact Person","",{"$nulls":3},"Perform test with cold instrument."]
[]
[]
[{"$nulls":17},{"$f":"\"Control Limits: \"&IF(OR($T$5=1,$T$5=2),Def!$B$23,IF($T$5=4,Def!$B$57,\"\"))","v":"Control Limits: MT Control Limits"}]
[]
[]
[{"$nulls":17},"************"]
[]
[]
[{"$nulls":13},{"$f":"Def!$B$29","v":"Test Results %MCN"}]
{"$rows_left_out":53}
{"sheet":"Report 160°C","index":4,"n_rows":72,"n_cols":24,"rows_kept":72,"merged":[[0,1,1,2],[0,3,1,9],[2,3,2,9],[2,19,3,19],[2,20,3,20],[2,21,3,22],[3,8,3,14],[5,1,5,4],[5,7,5,8],[5,10,5,13],[5,14,5,15],[6,11,6,13],[7,11,7,13],[8,12,9,14],[10,7,10,9],[10,12,15,14],[11,7,12,9],[19,13,20,14],[21,13,24,14],[25,13,26,14],[36,1,38,5],[36,7,38,11],[40,1,41,2],[40,3,41,9],[40,10,41,14],[43,1,45,1],[43,2,45,2],[43,3,43,4],[43,5,43,7],[43,8,43,12],[43,13,45,14],[44,3,45,3],[44,4,45,4],[44,5,45,5],[44,6,45,6],[44,7,45,7],[44,8,45,12],[44,19,45,19],[44,20,45,20],[44,21,45,21],[44,22,44,23],[46,8,46,12],[46,13,46,14],[47,8,47,12],[47,13,47,14],[48,8,48,12],[48,13,48,14],[49,8,49,12],[49,13,49,14],[50,8,50,12],[50,13,50,14],[51,8,51,12],[51,13,51,14],[52,8,52,12],[52,13,52,14],[53,8,53,12],[53,13,53,14],[54,8,54,12],[54,13,54,14],[55,8,55,12],[55,13,55,14],[56,8,56,12],[56,13,56,14],[57,8,57,12],[57,13,57,14],[58,8,58,12],[58,13,58,14],[59,8,59,12],[59,13,59,14],[60,8,60,12],[60,13,60,14],[61,8,61,12],[61,13,61,14],[62,8,62,12],[62,13,62,14],[63,8,63,12],[63,13,63,14],[64,8,64,12],[64,13,64,14],[65,8,65,12],[65,13,65,14],[66,8,66,12],[66,13,66,14],[67,8,67,12],[67,13,67,14],[68,8,68,12],[68,13,68,14],[69,8,69,12],[69,13,69,14],[71,1,71,4],[71,6,71,10],[72,1,74,4],[72,6,74,11]]}
[null,"SmartCalTM",null,{"$f":"Def!$B$6","v":"Performance test for Moisture Analyzer"}]
[{"$nulls":17},"Are D7 to D11 complete?"]
[null,{"$f":"Def!$B$68","v":"Version 2.10   2012-03"},null,{"$f":"$R$33","v":"Test temperature 160°C"},{"$nulls":13},{"$f":"(OR(AND(OR($T$5=1,$T$5=2,$T$5=3),$S$3+COUNTA($O$7:$O$8)=5),AND($T$5=4,COUNT($O$7:$O$8)=2,$S$3=5)))","v":false},{"$f":"COUNTA(Initial!D5:E9)","v":0},"Control limits Source","Selected Language","Define Limits Temperature"]
[{"$nulls":17},"Temperature number"]
[{"$nulls":14},{"$f":"IF($T$5=\"\",\"\",IF(AND(OR($T$5<4,$T$5>4),COUNTA($O$7:$O$8)>0),Def!$B$73,\"\"))","v":""},null,null,4,null,{"$f":"Initial!$P$11","v":1},{"$f":"Initial!$P$2","v":1},{"$f":"Initial!$P$5","v":"100°C"},{"$f":"Initial!$P$4","v":2}]
[null,{"$f":"Def!$B$10","v":"Instrument identification"},{"$nulls":5},{"$f":"Def!$B$16","v":"Testing parameter"},null,null,{"$f":"IF(OR($T$5=1,$T$5=2),Def!$B$24,\"\")","v":"MT Control Limits [%MC]"},{"$nulls":3},{"$f":"IF($T$5=1,Def!$B$63,IF($T$5=2,Def!$B$20,IF($T$5=4,Def!$B$64,\"\")))","v":"Certified"},null,null,{"$f":"Def!$B$39","v":"Yes"}]
[null,null,{"$f":"Def!$B$11:$B$15","v":"Company"},{"$f":"IF(Initial!$D$5:$D$9=\"\",\"\",Initial!$D$5:$D$9)","v":""},{"$nulls":4},{"$f":"Def!$B$17","v":"Switch-off criterion"},{"$f":"Initial!$J$6:$J$8","v":"Time (10 min)"},null,{"$f":"IF($O$5>\"\",\"\",Def!$B$25&\"   \"&IF($T$5=1,TEXT($S$39,\"0.0\"),IF($T$5=2,TEXT($S$38,\"0.0\"),IF($T$5=3,IF($W$5=$R$5,TEXT(Initial!$L$19,\"0.0\"),\"\"),\"\"))))","v":"Lower Limit   10.0"},{"$nulls":5},{"$f":"Def!$B$40","v":"No"},null,{"$f":"COUNTA(D7:D11)","v":5}]
[null,null,"Instrument type","",{"$nulls":4},{"$f":"Def!$B$19","v":"Drying program"},"Standard",null,{"$f":"IF($O$5>\"\",\"\",Def!$B$26&\"   \"&IF($T$5=1,TEXT($S$37,\"0.0\"),IF($T$5=2,TEXT($S$36,\"0.0\"),IF($T$5=3,IF($W$5=$R$5,TEXT(Initial!$L$20,\"0.0\"),\"\"),\"\"))))","v":"Upper Limit   11.6"}]
[null,null,"Instrument ID","",{"$nulls":4},{"$f":"Def!$B$21","v":"Display mode"},"%MC",null,null,{"$f":"IF($T$5=\"\",\"\",IF(AND($I$4=$R$12,$O$7>0,$O$8>0,$O$8<$O$7),Def!$B$74,\"\"))","v":""},{"$nulls":4},"************"]
[null,null,"Location",""]
[null,null,"Contact Person","",{"$nulls":3},"Perform test with cold instrument."]
[]
[]
[{"$nulls":17},{"$f":"\"Control Limits: \"&IF(OR($T$5=1,$T$5=2),Def!$B$23,IF($T$5=4,Def!$B$57,\"\"))","v":"Control Limits: MT Control Limits"}]
[]
[]
[{"$nulls":17},"************"]
[]
[]
[{"$nulls":13},{"$f":"Def!$B$29","v":"Test Results %MCN"}]
{"$rows_left_out":53}
{"sheet":"Report Other","index":5,"n_rows":72,"n_cols":23,"rows_kept":72,"merged":[[0,1,1,2],[0,3,1,9],[2,3,2,9],[2,19,3,19],[2,20,3,20],[2,21,3,22],[3,8,3,14],[5,1,5,4],[5,7,5,8],[5,10,5,13],[5,14,5,15],[6,11,6,13],[7,11,7,13],[8,12,9,14],[10,7,10,9],[10,12,15,14],[11,7,12,9],[19,13,20,14],[21,13,24,14],[25,13,26,14],[36,1,38,5],[36,7,38,11],[40,1,41,2],[40,3,41,9],[40,10,41,14],[43,1,45,1],[43,2,45,2],[43,3,43,4],[43,5,43,7],[43,8,43,12],[43,13,45,14],[44,3,45,3],[44,4,45,4],[44,5,45,5],[44,6,45,6],[44,7,45,7],[44,8,45,12],[44,19,45,19],[44,20,45,20],[44,21,45,21],[44,22,44,23],[46,8,46,12],[46,13,46,14],[47,8,47,12],[47,13,47,14],[48,8,48,12],[48,13,48,14],[49,8,49,12],[49,13,49,14],[50,8,50,12],[50,13,50,14],[51,8,51,12],[51,13,51,14],[52,8,52,12],[52,13,52,14],[53,8,53,12],[53,13,53,14],[54,8,54,12],[54,13,54,14],[55,8,55,12],[55,13,55,14],[56,8,56,12],[56,13,56,14],[57,8,57,12],[57,13,57,14],[58,8,58,12],[58,13,58,14],[59,8,59,12],[59,13,59,14],[60,8,60,12],[60,13,60,14],[61,8,61,12],[61,13,61,14],[62,8,62,12],[62,13,62,14],[63,8,63,12],[63,13,63,14],[64,8,64,12],[64,13,64,14],[65,8,65,12],[65,13,65,14],[66,8,66,12],[66,13,66,14],[67,8,67,12],[67,13,67,14],[68,8,68,12],[68,13,68,14],[69,8,69,12],[69,13,69,14],[71,1,71,4],[71,6,71,10],[72,1,74,4],[72,6,74,11]]}
[null,"SmartCalTM",null,{"$f":"Def!$B$6","v":"Performance test for Moisture Analyzer"}]
[{"$nulls":17},"Are D7 to D11 complete?"]
[null,{"$f":"Def!$B$68","v":"Version 2.10   2012-03"},null,{"$f":"$R$33","v":""},{"$nulls":13},{"$f":"OR(AND(OR($T$5=1,$T$5=2,$T$5=3),$S$3+COUNTA($O$7:$O$8)=5),AND($T$5=4,COUNT($O$7:$O$8)=2,$S$3=5))","v":false},{"$f":"COUNTA(Initial!D5:E9)","v":0},"Control limits Source","Selected Language","Define Limits Temperature"]
[{"$nulls":17},"Temperature number"]
[{"$nulls":14},{"$f":"IF($T$5=\"\",\"\",IF(AND(OR($T$5<4,$T$5>4),COUNTA($O$7:$O$8)>0),Def!$B$73,\"\"))","v":""},null,null,5,null,{"$f":"Initial!$P$11","v":1},{"$f":"Initial!$P$2","v":1},{"$f":"Initial!$P$5","v":"100°C"},{"$f":"Initial!$P$4","v":2}]
[null,{"$f":"Def!$B$10","v":"Instrument identification"},{"$nulls":5},{"$f":"Def!$B$16","v":"Testing parameter"},{"$nulls":6},{"$f":"IF(OR($T$5=1,$T$5=2),\"\",IF($T$5=4,Def!$B$64,\"\"))","v":""},null,null,{"$f":"Def!$B$39","v":"Yes"}]
[null,null,{"$f":"Def!$B$11:$B$15","v":"Company"},{"$f":"IF(Initial!$D$5:$D$9=\"\",\"\",Initial!$D$5:$D$9)","v":""},{"$nulls":4},{"$f":"Def!$B$17","v":"Switch-off criterion"},{"$f":"Initial!$J$6:$J$8","v":"Time (10 min)"},null,{"$f":"IF($O$5>\"\",\"\",IF($T$5=4,Def!$B$25,IF($T$5=3,IF($W$5=$R$5,Def!$B$25&\"  \"&TEXT(Initial!$L$19,\"0.0\"),\"\"),\"\")))","v":""},{"$nulls":5},{"$f":"Def!$B$40","v":"No"}]
[null,null,"Instrument type","",{"$nulls":4},{"$f":"Def!$B$19","v":"Drying program"},"Standard",null,{"$f":"IF($O$5>\"\",\"\",IF($T$5=4,Def!$B$26,IF($T$5=3,IF($W$5=$R$5,Def!$B$26&\"  \"&TEXT(Initial!$L$20,\"0.0\"),\"\"),\"\")))","v":""}]
[null,null,"Instrument ID","",{"$nulls":4},{"$f":"Def!$B$21","v":"Display mode"},"%MC",null,null,{"$f":"IF($T$5=\"\",\"\",IF(AND($I$4=$R$12,$O$7>0,$O$8>0,$O$8<$O$7),Def!$B$74,\"\"))","v":""},{"$nulls":4},"************"]
[null,null,"Location",""]
[null,null,"Contact Person","",{"$nulls":3},"Perform test with cold instrument."]
[]
[]
[{"$nulls":17},{"$f":"\"Control Limits: \"&IF(OR($T$5=1,$T$5=2),Def!$B$23,IF($T$5=4,Def!$B$57,\"\"))","v":"Control Limits: MT Control Limits"}]
[]
[]
[{"$nulls":17},"************"]
[]
[]
[{"$nulls":13},{"$f":"Def!$B$29","v":"Test Results %MCN"}]
{"$rows_left_out":45}
{"sheet":"Def","index":6,"n_rows":128,"n_cols":12,"rows_kept":128,"hidden":true,"merged":[[101,2,101,3],[102,1,103,1],[102,2,102,3],[102,4,102,5],[119,0,120,1],[122,1,124,1]]}
["Ort",null,"English","Deutsch","Français","Italiano","Español","Português","Русский (Russian)","中文 (Chinese)","日本語  (Japanese)","한국어  (Korean)"]
[]
[null,{"$f":"INDEX(commDef,,Initial!$P$2)","v":"Measurement Report"},"Measurement Report","Messprotokoll","Rapport de mesure","Registro delle misure","Informe de medición","Registro de Medição","Протокол измерения","测试记录表","測定記録","측정 기록"]
[null,{"$f":"INDEX(commDef,,Initial!$P$2)","v":"Initial data"},"Initial data","Initial data","Initial data","Initial data","Initial data","Initial data","Initial data","Initial data","Initial data","Initial data"]
[null,{"$f":"INDEX(commDef,,Initial!$P$2)","v":"Report"},"Report","Protokoll","Rapport","Registro","Informe","Registro","Протокол","记录","レポート","기록"]
[null,{"$f":"INDEX(commDef,,Initial!$P$2)","v":"Performance test for Moisture Analyzer"},"Performance test for Moisture Analyzer","Funktionstest für Moisture Analyzer","Test de performance pour le dessiccateur","Test per analizzatore di umidità","Test de rendimiento para analizador de humedad","Teste de esempenho para o analisador de umidade","Проверка анализатора влажности","卤素水分测定仪性能测试","水分計の性能検査","수분분석기 성능시험"]
[]
[]
[null,{"$f":"INDEX(commDef,,Initial!$P$2)","v":"Test temperature"},"Test temperature","Testtemperatur","Test de température","Temperatura test","Test de temperatura","Temperatura de teste","Температура проверки","测试温度 ","検査温度","시험 온도"]
[null,{"$f":"INDEX(commDef,,Initial!$P$2)","v":"Instrument identification"},"Instrument identification","Instrumentidentifizierung","Identification instrument","Identificazione strumento","Identificación del instrumento","Identificação do instrumento","Идентификация прибора","产品标识","製品仕様","제품 식별"]
[null,{"$f":"INDEX(commDef,,Initial!$P$2)","v":"Company"},"Company","Firma","Société","Ditta","Empresa","Empresa","Компания","公司","会社名","회사"]
[null,{"$f":"INDEX(commDef,,Initial!$P$2)","v":"Instrument type"},"Instrument type","Instrument","Type d'instrument","Tipo di strumento","Tipo de instrumento","Tipo de instrumento","Тип прибора","仪器型号","製品型式","기기 종류"]
[null,{"$f":"INDEX(commDef,,Initial!$P$2)","v":"Instrument ID"},"Instrument ID","Instrument ID","ID instrument","ID strumento","ID de instrumento","ID do instrumento","ID прибора","仪器标识","製品ID","기기 ID"]
[null,{"$f":"INDEX(commDef,,Initial!$P$2)","v":"Location"},"Location","Einsatzort","Emplacement","Localizzazione","Ubicación","Localização","локация","位置","住所","위치"]
[null,{"$f":"INDEX(commDef,,Initial!$P$2)","v":"Contact Person"},"Contact Person","Kontaktperson","Personne à contacter","Contatto","Persona de contacto","Pessoa de contato","Контактное лицо","联系人","担当者","담당자"]
[null,{"$f":"INDEX(commDef,,Initial!$P$2)","v":"Testing parameter"},"Testing parameter","Testparameter","L'analyse des paramètres","Parametri test","Parámetro de prueba","Parâmetros do teste","Тестируемый параметр","测试参数","検査パラメーター","시험 파라미터"]
[null,{"$f":"INDEX(commDef,,Initial!$P$2)","v":"Switch-off criterion"},"Switch-off criterion","Abschaltkriterium","Critère d'arrêt","Criterio di disinserzione","Criterio de desconexión","Criterio de desconexão","Критерий остановки","关机模式","スイッチオフ基準","가열 중지 기준"]
[null,{"$f":"INDEX(commDef,,Initial!$P$2)","v":"Time (10 min)"},"Time (10 min)","Zeit (10 min)","Temps (10 min)","Tempo (10 min)","Tiempo (10 min)","Tempo (10 min)","Время (10мин)","定时 (10分钟)","時間（10分）","시간 (10 분)"]
[null,{"$f":"INDEX(commDef,,Initial!$P$2)","v":"Drying program"},"Drying program","Trocknungsprogramm","Progr. de dessiccation","Progr. essiccamento","Programa de secado","Programa de secagem","Программа сушки","升温程序","乾燥プログラム","건조프로그램"]
[null,{"$f":"INDEX(commDef,,Initial!$P$2)","v":"Standard"},"Standard","Standard","Standard","Standard","Estándar","Padrão","Стандартная","标准","標準","표준 "]
{"$rows_left_out":75}