{"text_format":"3","workbook":"xlsx","n_sheets":7,"sheets":["Initial","Report 70°C","Report 100°C","Report 130°C","Report 160°C","Report Other","Def"],"not_rendered":{"charts":5,"images":1,"defined_names":31},"read":"whole","date_system":"1900"}

{"sheet":"Initial","index":0,"n_rows":29,"n_cols":17,"rows_kept":29,"merged":[[0,1,0,2],[0,10,0,11],[1,1,1,2],[2,7,2,8],[2,9,2,10],[3,1,3,4],[4,1,4,2],[4,3,4,4],[4,6,8,6],[4,7,4,8],[5,1,5,2],[5,3,5,4],[5,7,5,8],[6,1,6,2],[6,3,6,4],[6,7,6,8],[7,1,7,2],[7,3,7,4],[7,7,7,8],[8,1,8,2],[8,3,8,4]]}
[null,"SmartCalTM",{"$nulls":4},{"$f":"Def!$B$4","v":"Initial data"},{"$nulls":3},"English",{"$nulls":3},{"$f":"TRANSPOSE(Def!$C$1:$P$1)","v":"English"},"Selected Language"]
[null,{"$f":"Def!$B$68","v":"Version 2.10   2012-03"},{"$nulls":12},"Deutsch",{"$f":"MATCH($K$1,$O$1:$O$10,0)","v":1}]
[{"$nulls":7},"Control Limits:",null,"MT Control Limits (certified)",{"$nulls":4},"Français","Selected Temperature"]
[null,{"$f":"Def!$B$10","v":"Instrument identification"},{"$nulls":12},"Italiano",{"$f":"MATCH($J$5,$P$25:$P$29,0)","v":2}]
[null,{"$f":"Def!$B$11","v":"Company"},{"$nulls":5},{"$f":"Def!$B$9","v":"Test temperature"},null,"100°C",{"$f":"IF($J$5=$P$29,\">>>>\",\"\")","v":""},{"$nulls":3},"Español",{"$f":"IF($P$4<5,$J$5,$L$5)","v":"100°C"}]
[null,{"$f":"Def!$B$12","v":"Instrument type"},{"$nulls":5},{"$f":"Def!$B$17","v":"Switch-off criterion"},null,{"$f":"Def!$B$18","v":"Time (10 min)"},{"$nulls":4},"Português",{"$f":"IF($J$5=$P$29,\"-----\",Def!$B$54:$B$55)","v":"MT Control Limits (certified)"},{"$f":"Def!$B$54:$B$57","v":"MT Control Limits (certified)"}]
[null,{"$f":"Def!$B$13","v":"Instrument ID"},{"$nulls":5},{"$f":"Def!$B$19","v":"Drying program"},null,{"$f":"Def!$B$20","v":"Standard"},{"$nulls":4},"Русский (Russian)","MT Control Limits (standard)","MT Control Limits (standard)"]
[null,{"$f":"Def!$B$14","v":"Location"},{"$nulls":5},{"$f":"Def!$B$21","v":"Display mode"},null,{"$f":"Def!$B$36","v":"%MC"},{"$nulls":4},"中文 (Chinese)",{"$f":"Def!$B$57","v":"Manual input limits"},"- - - - - -"]
[null,{"$f":"Def!$B$15","v":"Contact Person"},{"$nulls":12},"日本語  (Japanese)",null,"Manual input limits"]
[{"$nulls":14},"한국어  (Korean)","Patched Control Limits","Selected Control Limits"]
[{"$nulls":14},0,{"$f":"IF($Q$11=\"\",\"\",IF($Q$11=4,3,IF($Q$11=3,4,$Q$11)))","v":1},{"$f":"IF(ISERROR(MATCH($J$3,$P$6:$P$9,0)),\"\",MATCH($J$3,$P6:$P$9,0))","v":1}]
[{"$nulls":14},0,"All header information?"]
[{"$nulls":14},"TODAY",{"$f":"COUNTA($D$5:$D$9)=5","v":false}]
[{"$nulls":14},{"$f":"TODAY()","v":"2012-10-23"},{"$f":"AND($P$13,COUNTA($B14:$G14)=5)","v":false},{"$f":"CorrMC2","v":{"v":-0.3981778275591398,"d":"-0.40"}}]
[{"$nulls":15},false,{"v":-0.3981778275591398,"d":"-0.40"}]
[{"$nulls":15},false,{"v":-0.3981778275591398,"d":"-0.40"}]
[{"$nulls":15},false,{"v":-0.3981778275591398,"d":"-0.40"}]
[{"$nulls":15},false,{"v":-0.3981778275591398,"d":"-0.40"}]
[{"$nulls":15},false,{"v":-0.3981778275591398,"d":"-0.40"}]
[{"$nulls":15},false,{"v":-0.3981778275591398,"d":"-0.40"}]
[{"$nulls":15},false,{"v":-0.3981778275591398,"d":"-0.40"}]
[{"$nulls":15},false,{"v":-0.3981778275591398,"d":"-0.40"}]
[{"$nulls":15},false,{"v":-0.3981778275591398,"d":"-0.40"}]
[]
[{"$nulls":15},{"$f":"Def!$B$105:$B$108","v":"70°C"}]
[{"$nulls":15},"100°C"]
[{"$nulls":15},"130°C"]
[{"$nulls":15},"160°C"]
[{"$nulls":15},{"$f":"Def!$B$51","v":"other"}]

{"sheet":"Report 70°C","index":1,"n_rows":72,"n_cols":24,"rows_kept":72,"merged":[[0,1,1,2],[0,3,1,9],[2,3,2,9],[2,19,3,19],[2,20,3,20],[2,21,3,22],[3,8,3,14],[5,1,5,4],[5,7,5,8],[5,10,5,13],[5,14,5,15],[6,11,6,13],[7,11,7,13],[8,12,9,14],[10,7,10,9],[10,12,15,14],[11,7,12,9],[19,13,20,14],[21,13,24,14],[25,13,26,14],[36,1,38,5],[36,7,38,11],[40,1,41,2],[40,3,41,9],[40,10,41,14],[43,1,45,1],[43,2,45,2],[43,3,43,4],[43,5,43,7],[43,8,43,12],[43,13,45,14],[44,3,45,3],[44,4,45,4],[44,5,45,5],[44,6,45,6],[44,7,45,7],[44,8,45,12],[44,19,45,19],[44,20,45,20],[44,21,45,21],[44,22,44,23],[46,8,46,12],[46,13,46,14],[47,8,47,12],[47,13,47,14],[48,8,48,12],[48,13,48,14],[49,8,49,12],[49,13,49,14],[50,8,50,12],[50,13,50,14],[51,8,51,12],[51,13,51,14],[52,8,52,12],[52,13,52,14],[53,8,53,12],[53,13,53,14],[54,8,54,12],[54,13,54,14],[55,8,55,12],[55,13,55,14],[56,8,56,12],[56,13,56,14],[57,8,57,12],[57,13,57,14],[58,8,58,12],[58,13,58,14],[59,8,59,12],[59,13,59,14],[60,8,60,12],[60,13,60,14],[61,8,61,12],[61,13,61,14],[62,8,62,12],[62,13,62,14],[63,8,63,12],[63,13,63,14],[64,8,64,12],[64,13,64,14],[65,8,65,12],[65,13,65,14],[66,8,66,12],[66,13,66,14],[67,8,67,12],[67,13,67,14],[68,8,68,12],[68,13,68,14],[69,8,69,12],[69,13,69,14],[71,1,71,4],[71,6,71,10],[72,1,74,4],[72,6,74,11]]}
[null,"SmartCalTM",null,{"$f":"Def!$B$6","v":"Performance test for Moisture Analyzer"}]
[{"$nulls":17},"Are D7 to D11 complete?"]
[null,{"$f":"Def!$B$68","v":"Version 2.10   2012-03"},null,{"$f":"$R$33","v":"Test temperature 70°C"},{"$nulls":13},{"$f":"(OR(AND(OR($T$5=1,$T$5=2,$T$5=3),$S$3+COUNTA($O$7:$O$8)=5),AND($T$5=4,COUNT($O$7:$O$8)=2,$S$3=5)))","v":false},{"$f":"COUNTA(Initial!D5:E9)","v":0},"Control limits Source","Selected Language","Selected Temperature"]
[{"$nulls":17},"Temperature number"]
[{"$nulls":14},{"$f":"IF($T$5=\"\",\"\",IF(AND(OR($T$5<4,$T$5>4),COUNTA($O$7:$O$8)>0),Def!$B$73,\"\"))","v":""},null,null,1,null,{"$f":"Initial!$P$11","v":1},{"$f":"Initial!$P$2","v":1},{"$f":"Initial!$P$5","v":"100°C"},{"$f":"Initial!$P$4","v":2}]
[null,{"$f":"Def!$B$10","v":"Instrument identification"},{"$nulls":5},{"$f":"Def!$B$16","v":"Testing parameter"},null,null,{"$f":"IF(OR($T$5=1,$T$5=2),Def!$B$24,\"\")","v":"MT Control Limits [%MC]"},{"$nulls":3},{"$f":"IF($T$5=1,Def!$B$63,IF($T$5=2,Def!$B$20,IF($T$5=4,Def!$B$64,\"\")))","v":"Certified"},null,null,{"$f":"Def!$B$39","v":"Yes"}]
[null,null,{"$f":"Def!$B$11:$B$15","v":"Company"},{"$f":"IF(Initial!$D$5:$D$9=\"\",\"\",Initial!$D$5:$D$9)","v":""},{"$nulls":4},{"$f":"Def!$B$17","v":"Switch-off criterion"},{"$f":"Initial!$J$6:$J$8","v":"Time (10 min)"},null,{"$f":"IF($O$5>\"\",\"\",Def!$B$25&\"   \"&IF($T$5=1,TEXT($S$39,\"0.0\"),IF($T$5=2,TEXT($S$38,\"0.0\"),IF($T$5=3,IF($W$5=$R$5,TEXT(Initial!$L$19,\"0.0\"),\"\"),\"\"))))","v":"Lower Limit   3.3"},{"$nulls":5},{"$f":"Def!$B$40","v":"No"}]
[null,null,"Instrument type","",{"$nulls":4},{"$f":"Def!$B$19","v":"Drying program"},"Standard",null,{"$f":"IF($O$5>\"\",\"\",Def!$B$26&\"   \"&IF($T$5=1,TEXT($S$37,\"0.0\"),IF($T$5=2,TEXT($S$36,\"0.0\"),IF($T$5=3,IF($W$5=$R$5,TEXT(Initial!$L$20,\"0.0\"),\"\"),\"\"))))","v":"Upper Limit   4.3"}]
[null,null,"Instrument ID","",{"$nulls":4},{"$f":"Def!$B$21","v":"Display mode"},"%MC",null,null,{"$f":"IF($T$5=\"\",\"\",IF(AND($I$4=$R$12,$O$7>0,$O$8>0,$O$8<$O$7),Def!$B$74,\"\"))","v":""},{"$nulls":4},"************"]
[null,null,"Location",""]
[null,null,"Contact Person","",{"$nulls":3},"Perform test with cold instrument."]
[]
[]
[{"$nulls":17},{"$f":"\"Control Limits: \"&IF(OR($T$5=1,$T$5=2),Def!$B$23,IF($T$5=4,Def!$B$57,\"\"))","v":"Control Limits: MT Control Limits"}]
[]
[]
[{"$nulls":17},"************"]
[]
[]
[{"$nulls":13},{"$f":"Def!$B$29","v":"Test Results %MCN"}]
[]
[{"$nulls":13},{"$f":"IF(AND($T$5=3,OR($O$7=\"\",$O$8=\"\")),\"\",$R$14)","v":"Control Limits: MT Control Limits"}]
[]
[]
[]
[{"$nulls":13},{"$f":"IF(OR($T$5=3,$T$5=4),$W$45,\"\")","v":""}]
[]
[]
[]
[]
[]
[{"$nulls":17},"************"]
[{"$nulls":17},{"$f":"Def!$B$9&\" \"&\"70°C\"","v":"Test temperature 70°C"}]
[]
[{"$nulls":17},"MT Calibration limits"]
[null,{"$f":"Def!$B$67","v":"Data reviewed by (signature and date)"},{"$nulls":5},{"$f":"Def!$B$71","v":"Reviewer's Comments"},{"$nulls":9},"Upper standard",{"$f":"TRANSPOSE(Def!$C$105:$F$105)","v":4.4}]
[{"$nulls":17},"Upper certified",4.3]
[{"$nulls":17},"Lower standard",3.2]
[{"$nulls":17},"Lower certified",3.3]
[]
[null,"SmartCalTM",null,{"$f":"Def!$B$6","v":"Performance test for Moisture Analyzer"},{"$nulls":6},{"$f":"$R$33","v":"Test temperature 70°C"}]
[{"$nulls":17},{"$f":"TODAY()","v":"2012-10-23"}]
[null,{"$f":"Def!$B$68","v":"Version 2.10   2012-03"}]
[null,{"$f":"Def!$B$31","v":"Date"},{"$f":"Def!$B$70","v":"SmartCal Lot No."},{"$f":"Def!$B$33","v":"Environmental conditions"},null,{"$f":"Def!$B$28","v":"Test Results"},null,null,{"$f":"Def!$B$42","v":"Remarks"},{"$nulls":4},{"$f":"Def!$B$44","v":"Name"}]
[{"$nulls":3},{"$f":"Def!$B$34","v":"%RH"},{"$f":"Def!$B$35","v":"°C"},{"$f":"Def!$B$36","v":"%MC"},{"$f":"Def!$B$37","v":"%MCN"},{"$f":"Def!$B$38","v":"Within Limits"},{"$f":"Def!$B$43","v":"e.g. Package damaged, adjustment done etc."},{"$nulls":10},"ENTRIES COMPLETE?","REPORTED ANSWERS","PLOTTED ANSWERS",{"$f":"Def!$B$54","v":"MT Control Limits (certified)"}]
[{"$nulls":17},"LOWER LIMIT","UPPER LIMIT",{"$nulls":3},"LOWER LIMIT","UPPER LIMIT"]
[1,{"$nulls":5},{"$f":"Result_070_2","v":""},{"$f":"WithinLimits_070","v":""},{"$nulls":9},{"$f":"IF($T$5=1,$S$39,IF($T$5=2,$S$38,IF($T$5=4,IF($M$9=\"\",$O$7,\"\"),IF(AND($T$5=3,$W$5=$R$5),Initial!$L$19,\"\"))))","v":{"v":3.3,"d":"3.30"}},{"$f":"IF($T$5=1,$S$37,IF($T$5=2,$S$36,IF($T$5=4,IF($M$9=\"\",$O$8,\"\"),IF(AND($T$5=3,$W$5=$R$5),Initial!$L$20,\"\"))))","v":{"v":4.3,"d":"4.30"}},{"$f":"AND($R$3,COUNTA($B47:$E47,$N47)=5)","v":false},{"$f":"CorrMC1_070","v":{"v":-0.3981778275591398,"d":"-0.40"}},{"$f":"Result_070_1","v":{"$error":"#N/A"}},{"$f":"IF($T$5=1,\"\",IF($T$5=2,\"\",IF($T$5=3,$S$39,IF($T$5=4,$S$39,\"\"))))","v":""},{"$f":"IF($T$5=1,\"\",IF($T$5=2,\"\",IF($T$5=3,$S$37,IF($T$5=4,$S$37,\"\"))))","v":""}]
[2,{"$nulls":5},"","",{"$nulls":9},{"$f":"IF($T$5=1,$S$39,IF($T$5=2,$S$38,IF($T$5=4,IF($M$9=\"\",$O$7,\"\"),IF(AND($T$5=3,$W$5=$R$5),Initial!$L$19,\"\"))))","v":{"v":3.3,"d":"3.30"}},{"$f":"IF($T$5=1,$S$37,IF($T$5=2,$S$36,IF($T$5=4,IF($M$9=\"\",$O$8,\"\"),IF(AND($T$5=3,$W$5=$R$5),Initial!$L$20,\"\"))))","v":{"v":4.3,"d":"4.30"}},{"$f":"AND($R$3,COUNTA($B48:$E48,$N48)=5)","v":false},{"v":-0.3981778275591398,"d":"-0.40"},{"$error":"#N/A"},{"$f":"IF($T$5=1,\"\",IF($T$5=2,\"\",IF($T$5=3,$S$39,IF($T$5=4,$S$39,\"\"))))","v":""},{"$f":"IF($T$5=1,\"\",IF($T$5=2,\"\",IF($T$5=3,$S$37,IF($T$5=4,$S$37,\"\"))))","v":""}]
[3,{"$nulls":5},"","",{"$nulls":9},{"$f":"IF($T$5=1,$S$39,IF($T$5=2,$S$38,IF($T$5=4,IF($M$9=\"\",$O$7,\"\"),IF(AND($T$5=3,$W$5=$R$5),Initial!$L$19,\"\"))))","v":{"v":3.3,"d":"3.30"}},{"$f":"IF($T$5=1,$S$37,IF($T$5=2,$S$36,IF($T$5=4,IF($M$9=\"\",$O$8,\"\"),IF(AND($T$5=3,$W$5=$R$5),Initial!$L$20,\"\"))))","v":{"v":4.3,"d":"4.30"}},false,{"v":-0.3981778275591398,"d":"-0.40"},{"$error":"#N/A"},"",""]
[4,{"$nulls":5},"","",{"$nulls":9},{"$f":"IF($T$5=1,$S$39,IF($T$5=2,$S$38,IF($T$5=4,IF($M$9=\"\",$O$7,\"\"),IF(AND($T$5=3,$W$5=$R$5),Initial!$L$19,\"\"))))","v":{"v":3.3,"d":"3.30"}},{"$f":"IF($T$5=1,$S$37,IF($T$5=2,$S$36,IF($T$5=4,IF($M$9=\"\",$O$8,\"\"),IF(AND($T$5=3,$W$5=$R$5),Initial!$L$20,\"\"))))","v":{"v":4.3,"d":"4.30"}},false,{"v":-0.3981778275591398,"d":"-0.40"},{"$error":"#N/A"},"",""]
[5,{"$nulls":5},"","",{"$nulls":9},{"$f":"IF($T$5=1,$S$39,IF($T$5=2,$S$38,IF($T$5=4,IF($M$9=\"\",$O$7,\"\"),IF(AND($T$5=3,$W$5=$R$5),Initial!$L$19,\"\"))))","v":{"v":3.3,"d":"3.30"}},{"$f":"IF($T$5=1,$S$37,IF($T$5=2,$S$36,IF($T$5=4,IF($M$9=\"\",$O$8,\"\"),IF(AND($T$5=3,$W$5=$R$5),Initial!$L$20,\"\"))))","v":{"v":4.3,"d":"4.30"}},false,{"v":-0.3981778275591398,"d":"-0.40"},{"$error":"#N/A"},"",""]
[6,{"$nulls":5},"","",{"$nulls":9},{"$f":"IF($T$5=1,$S$39,IF($T$5=2,$S$38,IF($T$5=4,IF($M$9=\"\",$O$7,\"\"),IF(AND($T$5=3,$W$5=$R$5),Initial!$L$19,\"\"))))","v":{"v":3.3,"d":"3.30"}},{"$f":"IF($T$5=1,$S$37,IF($T$5=2,$S$36,IF($T$5=4,IF($M$9=\"\",$O$8,\"\"),IF(AND($T$5=3,$W$5=$R$5),Initial!$L$20,\"\"))))","v":{"v":4.3,"d":"4.30"}},false,{"v":-0.3981778275591398,"d":"-0.40"},{"$error":"#N/A"},"",""]
[7,{"$nulls":5},"","",{"$nulls":9},{"$f":"IF($T$5=1,$S$39,IF($T$5=2,$S$38,IF($T$5=4,IF($M$9=\"\",$O$7,\"\"),IF(AND($T$5=3,$W$5=$R$5),Initial!$L$19,\"\"))))","v":{"v":3.3,"d":"3.30"}},{"$f":"IF($T$5=1,$S$37,IF($T$5=2,$S$36,IF($T$5=4,IF($M$9=\"\",$O$8,\"\"),IF(AND($T$5=3,$W$5=$R$5),Initial!$L$20,\"\"))))","v":{"v":4.3,"d":"4.30"}},false,{"v":-0.3981778275591398,"d":"-0.40"},{"$error":"#N/A"},"",""]
[8,{"$nulls":5},"","",{"$nulls":9},{"$f":"IF($T$5=1,$S$39,IF($T$5=2,$S$38,IF($T$5=4,IF($M$9=\"\",$O$7,\"\"),IF(AND($T$5=3,$W$5=$R$5),Initial!$L$19,\"\"))))","v":{"v":3.3,"d":"3.30"}},{"$f":"IF($T$5=1,$S$37,IF($T$5=2,$S$36,IF($T$5=4,IF($M$9=\"\",$O$8,\"\"),IF(AND($T$5=3,$W$5=$R$5),Initial!$L$20,\"\"))))","v":{"v":4.3,"d":"4.30"}},false,{"v":-0.3981778275591398,"d":"-0.40"},{"$error":"#N/A"},"",""]
[9,{"$nulls":5},"","",{"$nulls":9},{"$f":"IF($T$5=1,$S$39,IF($T$5=2,$S$38,IF($T$5=4,IF($M$9=\"\",$O$7,\"\"),IF(AND($T$5=3,$W$5=$R$5),Initial!$L$19,\"\"))))","v":{"v":3.3,"d":"3.30"}},{"$f":"IF($T$5=1,$S$37,IF($T$5=2,$S$36,IF($T$5=4,IF($M$9=\"\",$O$8,\"\"),IF(AND($T$5=3,$W$5=$R$5),Initial!$L$20,\"\"))))","v":{"v":4.3,"d":"4.30"}},false,{"v":-0.3981778275591398,"d":"-0.40"},{"$error":"#N/A"},"",""]
[10,{"$nulls":5},"","",{"$nulls":9},{"$f":"IF($T$5=1,$S$39,IF($T$5=2,$S$38,IF($T$5=4,IF($M$9=\"\",$O$7,\"\"),IF(AND($T$5=3,$W$5=$R$5),Initial!$L$19,\"\"))))","v":{"v":3.3,"d":"3.30"}},{"$f":"IF($T$5=1,$S$37,IF($T$5=2,$S$36,IF($T$5=4,IF($M$9=\"\",$O$8,\"\"),IF(AND($T$5=3,$W$5=$R$5),Initial!$L$20,\"\"))))","v":{"v":4.3,"d":"4.30"}},false,{"v":-0.3981778275591398,"d":"-0.40"},{"$error":"#N/A"},"",""]
[11,{"$nulls":5},"","",{"$nulls":9},{"$f":"IF($T$5=1,$S$39,IF($T$5=2,$S$38,IF($T$5=4,IF($M$9=\"\",$O$7,\"\"),IF(AND($T$5=3,$W$5=$R$5),Initial!$L$19,\"\"))))","v":{"v":3.3,"d":"3.30"}},{"$f":"IF($T$5=1,$S$37,IF($T$5=2,$S$36,IF($T$5=4,IF($M$9=\"\",$O$8,\"\"),IF(AND($T$5=3,$W$5=$R$5),Initial!$L$20,\"\"))))","v":{"v":4.3,"d":"4.30"}},false,{"v":-0.3981778275591398,"d":"-0.40"},{"$error":"#N/A"},"",""]
[12,{"$nulls":5},"","",{"$nulls":9},{"$f":"IF($T$5=1,$S$39,IF($T$5=2,$S$38,IF($T$5=4,IF($M$9=\"\",$O$7,\"\"),IF(AND($T$5=3,$W$5=$R$5),Initial!$L$19,\"\"))))","v":{"v":3.3,"d":"3.30"}},{"$f":"IF($T$5=1,$S$37,IF($T$5=2,$S$36,IF($T$5=4,IF($M$9=\"\",$O$8,\"\"),IF(AND($T$5=3,$W$5=$R$5),Initial!$L$20,\"\"))))","v":{"v":4.3,"d":"4.30"}},false,{"v":-0.3981778275591398,"d":"-0.40"},{"$error":"#N/A"},"",""]
[13,{"$nulls":5},"","",{"$nulls":9},{"$f":"IF($T$5=1,$S$39,IF($T$5=2,$S$38,IF($T$5=4,IF($M$9=\"\",$O$7,\"\"),IF(AND($T$5=3,$W$5=$R$5),Initial!$L$19,\"\"))))","v":{"v":3.3,"d":"3.30"}},{"$f":"IF($T$5=1,$S$37,IF($T$5=2,$S$36,IF($T$5=4,IF($M$9=\"\",$O$8,\"\"),IF(AND($T$5=3,$W$5=$R$5),Initial!$L$20,\"\"))))","v":{"v":4.3,"d":"4.30"}},false,{"v":-0.3981778275591398,"d":"-0.40"},{"$error":"#N/A"},"",""]
[14,{"$nulls":5},"","",{"$nulls":9},{"$f":"IF($T$5=1,$S$39,IF($T$5=2,$S$38,IF($T$5=4,IF($M$9=\"\",$O$7,\"\"),IF(AND($T$5=3,$W$5=$R$5),Initial!$L$19,\"\"))))","v":{"v":3.3,"d":"3.30"}},{"$f":"IF($T$5=1,$S$37,IF($T$5=2,$S$36,IF($T$5=4,IF($M$9=\"\",$O$8,\"\"),IF(AND($T$5=3,$W$5=$R$5),Initial!$L$20,\"\"))))","v":{"v":4.3,"d":"4.30"}},false,{"v":-0.3981778275591398,"d":"-0.40"},{"$error":"#N/A"},"",""]
[15,{"$nulls":5},"","",{"$nulls":9},{"$f":"IF($T$5=1,$S$39,IF($T$5=2,$S$38,IF($T$5=4,IF($M$9=\"\",$O$7,\"\"),IF(AND($T$5=3,$W$5=$R$5),Initial!$L$19,\"\"))))","v":{"v":3.3,"d":"3.30"}},{"$f":"IF($T$5=1,$S$37,IF($T$5=2,$S$36,IF($T$5=4,IF($M$9=\"\",$O$8,\"\"),IF(AND($T$5=3,$W$5=$R$5),Initial!$L$20,\"\"))))","v":{"v":4.3,"d":"4.30"}},false,{"v":-0.3981778275591398,"d":"-0.40"},{"$error":"#N/A"},"",""]
[16,{"$nulls":5},"","",{"$nulls":9},{"$f":"IF($T$5=1,$S$39,IF($T$5=2,$S$38,IF($T$5=4,IF($M$9=\"\",$O$7,\"\"),IF(AND($T$5=3,$W$5=$R$5),Initial!$L$19,\"\"))))","v":{"v":3.3,"d":"3.30"}},{"$f":"IF($T$5=1,$S$37,IF($T$5=2,$S$36,IF($T$5=4,IF($M$9=\"\",$O$8,\"\"),IF(AND($T$5=3,$W$5=$R$5),Initial!$L$20,\"\"))))","v":{"v":4.3,"d":"4.30"}},false,{"v":-0.3981778275591398,"d":"-0.40"},{"$error":"#N/A"},"",""]
[17,{"$nulls":5},"","",{"$nulls":9},{"$f":"IF($T$5=1,$S$39,IF($T$5=2,$S$38,IF($T$5=4,IF($M$9=\"\",$O$7,\"\"),IF(AND($T$5=3,$W$5=$R$5),Initial!$L$19,\"\"))))","v":{"v":3.3,"d":"3.30"}},{"$f":"IF($T$5=1,$S$37,IF($T$5=2,$S$36,IF($T$5=4,IF($M$9=\"\",$O$8,\"\"),IF(AND($T$5=3,$W$5=$R$5),Initial!$L$20,\"\"))))","v":{"v":4.3,"d":"4.30"}},false,{"v":-0.3981778275591398,"d":"-0.40"},{"$error":"#N/A"},"",""]
[18,{"$nulls":5},"","",{"$nulls":9},{"$f":"IF($T$5=1,$S$39,IF($T$5=2,$S$38,IF($T$5=4,IF($M$9=\"\",$O$7,\"\"),IF(AND($T$5=3,$W$5=$R$5),Initial!$L$19,\"\"))))","v":{"v":3.3,"d":"3.30"}},{"$f":"IF($T$5=1,$S$37,IF($T$5=2,$S$36,IF($T$5=4,IF($M$9=\"\",$O$8,\"\"),IF(AND($T$5=3,$W$5=$R$5),Initial!$L$20,\"\"))))","v":{"v":4.3,"d":"4.30"}},false,{"v":-0.3981778275591398,"d":"-0.40"},{"$error":"#N/A"},"",""]
[19,{"$nulls":5},"","",{"$nulls":9},{"$f":"IF($T$5=1,$S$39,IF($T$5=2,$S$38,IF($T$5=4,IF($M$9=\"\",$O$7,\"\"),IF(AND($T$5=3,$W$5=$R$5),Initial!$L$19,\"\"))))","v":{"v":3.3,"d":"3.30"}},{"$f":"IF($T$5=1,$S$37,IF($T$5=2,$S$36,IF($T$5=4,IF($M$9=\"\",$O$8,\"\"),IF(AND($T$5=3,$W$5=$R$5),Initial!$L$20,\"\"))))","v":{"v":4.3,"d":"4.30"}},false,{"v":-0.3981778275591398,"d":"-0.40"},{"$error":"#N/A"},"",""]
[20,{"$nulls":5},"","",{"$nulls":9},{"$f":"IF($T$5=1,$S$39,IF($T$5=2,$S$38,IF($T$5=4,IF($M$9=\"\",$O$7,\"\"),IF(AND($T$5=3,$W$5=$R$5),Initial!$L$19,\"\"))))","v":{"v":3.3,"d":"3.30"}},{"$f":"IF($T$5=1,$S$37,IF($T$5=2,$S$36,IF($T$5=4,IF($M$9=\"\",$O$8,\"\"),IF(AND($T$5=3,$W$5=$R$5),Initial!$L$20,\"\"))))","v":{"v":4.3,"d":"4.30"}},false,{"v":-0.3981778275591398,"d":"-0.40"},{"$error":"#N/A"},"",""]
[21,{"$nulls":5},"","",{"$nulls":9},{"$f":"IF($T$5=1,$S$39,IF($T$5=2,$S$38,IF($T$5=4,IF($M$9=\"\",$O$7,\"\"),IF(AND($T$5=3,$W$5=$R$5),Initial!$L$19,\"\"))))","v":{"v":3.3,"d":"3.30"}},{"$f":"IF($T$5=1,$S$37,IF($T$5=2,$S$36,IF($T$5=4,IF($M$9=\"\",$O$8,\"\"),IF(AND($T$5=3,$W$5=$R$5),Initial!$L$20,\"\"))))","v":{"v":4.3,"d":"4.30"}},false,{"v":-0.3981778275591398,"d":"-0.40"},{"$error":"#N/A"},"",""]
[22,{"$nulls":5},"","",{"$nulls":9},{"$f":"IF($T$5=1,$S$39,IF($T$5=2,$S$38,IF($T$5=4,IF($M$9=\"\",$O$7,\"\"),IF(AND($T$5=3,$W$5=$R$5),Initial!$L$19,\"\"))))","v":{"v":3.3,"d":"3.30"}},{"$f":"IF($T$5=1,$S$37,IF($T$5=2,$S$36,IF($T$5=4,IF($M$9=\"\",$O$8,\"\"),IF(AND($T$5=3,$W$5=$R$5),Initial!$L$20,\"\"))))","v":{"v":4.3,"d":"4.30"}},false,{"v":-0.3981778275591398,"d":"-0.40"},{"$error":"#N/A"},"",""]
[23,{"$nulls":5},"","",{"$nulls":9},{"$f":"IF($T$5=1,$S$39,IF($T$5=2,$S$38,IF($T$5=4,IF($M$9=\"\",$O$7,\"\"),IF(AND($T$5=3,$W$5=$R$5),Initial!$L$19,\"\"))))","v":{"v":3.3,"d":"3.30"}},{"$f":"IF($T$5=1,$S$37,IF($T$5=2,$S$36,IF($T$5=4,IF($M$9=\"\",$O$8,\"\"),IF(AND($T$5=3,$W$5=$R$5),Initial!$L$20,\"\"))))","v":{"v":4.3,"d":"4.30"}},false,{"v":-0.3981778275591398,"d":"-0.40"},{"$error":"#N/A"},"",""]
[24,{"$nulls":5},"","",{"$nulls":9},{"$f":"IF($T$5=1,$S$39,IF($T$5=2,$S$38,IF($T$5=4,IF($M$9=\"\",$O$7,\"\"),IF(AND($T$5=3,$W$5=$R$5),Initial!$L$19,\"\"))))","v":{"v":3.3,"d":"3.30"}},{"$f":"IF($T$5=1,$S$37,IF($T$5=2,$S$36,IF($T$5=4,IF($M$9=\"\",$O$8,\"\"),IF(AND($T$5=3,$W$5=$R$5),Initial!$L$20,\"\"))))","v":{"v":4.3,"d":"4.30"}},false,{"v":-0.3981778275591398,"d":"-0.40"},{"$error":"#N/A"},"",""]
[]
[null,{"$f":"Def!$B$67","v":"Data reviewed by (signature and date)"},{"$nulls":4},{"$f":"Def!$B$71","v":"Reviewer's Comments"}]

{"sheet":"Report 100°C","index":2,"n_rows":72,"n_cols":24,"rows_kept":72,"merged":[[0,1,1,2],[0,3,1,9],[2,3,2,9],[2,19,3,19],[2,20,3,20],[2,21,3,22],[3,8,3,14],[5,1,5,4],[5,7,5,8],[5,10,5,13],[5,14,5,15],[6,11,6,13],[7,11,7,13],[8,12,9,14],[10,7,10,9],[10,12,15,14],[11,7,12,9],[19,13,20,14],[21,13,24,14],[25,13,26,14],[36,1,38,5],[36,7,38,11],[40,1,41,2],[40,3,41,9],[40,10,41,14],[43,1,45,1],[43,2,45,2],[43,3,43,4],[43,5,43,7],[43,8,43,12],[43,13,45,14],[44,3,45,3],[44,4,45,4],[44,5,45,5],[44,6,45,6],[44,7,45,7],[44,8,45,12],[44,19,45,19],[44,20,45,20],[44,21,45,21],[44,22,44,23],[46,8,46,12],[46,13,46,14],[47,8,47,12],[47,13,47,14],[48,8,48,12],[48,13,48,14],[49,8,49,12],[49,13,49,14],[50,8,50,12],[50,13,50,14],[51,8,51,12],[51,13,51,14],[52,8,52,12],[52,13,52,14],[53,8,53,12],[53,13,53,14],[54,8,54,12],[54,13,54,14],[55,8,55,12],[55,13,55,14],[56,8,56,12],[56,13,56,14],[57,8,57,12],[57,13,57,14],[58,8,58,12],[58,13,58,14],[59,8,59,12],[59,13,59,14],[60,8,60,12],[60,13,60,14],[61,8,61,12],[61,13,61,14],[62,8,62,12],[62,13,62,14],[63,8,63,12],[63,13,63,14],[64,8,64,12],[64,13,64,14],[65,8,65,12],[65,13,65,14],[66,8,66,12],[66,13,66,14],[67,8,67,12],[67,13,67,14],[68,8,68,12],[68,13,68,14],[69,8,69,12],[69,13,69,14],[71,1,71,4],[71,6,71,10],[72,1,74,4],[72,6,74,11]]}
[null,"SmartCalTM",null,{"$f":"Def!$B$6","v":"Performance test for Moisture Analyzer"}]
[{"$nulls":17},"Are D7 to D11 complete?"]
[null,{"$f":"Def!$B$68","v":"Version 2.10   2012-03"},null,{"$f":"$R$33","v":"Test temperature 100°C"},{"$nulls":13},{"$f":"(OR(AND(OR($T$5=1,$T$5=2,$T$5=3),$S$3+COUNTA($O$7:$O$8)=5),AND($T$5=4,COUNT($O$7:$O$8)=2,$S$3=5)))","v":false},{"$f":"COUNTA(Initial!D5:E9)","v":0},"Control limits Source","Selected Language","Selected Temperature"]
[{"$nulls":17},"Temperature number"]
[{"$nulls":14},{"$f":"IF($T$5=\"\",\"\",IF(AND(OR($T$5<4,$T$5>4),COUNTA($O$7:$O$8)>0),Def!$B$73,\"\"))","v":""},null,null,2,null,{"$f":"Initial!$P$11","v":1},{"$f":"Initial!$P$2","v":1},{"$f":"Initial!$P$5","v":"100°C"},{"$f":"Initial!$P$4","v":2}]
[null,{"$f":"Def!$B$10","v":"Instrument identification"},{"$nulls":5},{"$f":"Def!$B$16","v":"Testing parameter"},null,null,{"$f":"IF(OR($T$5=1,$T$5=2),Def!$B$24,\"\")","v":"MT Control Limits [%MC]"},{"$nulls":3},{"$f":"IF($T$5=1,Def!$B$63,IF($T$5=2,Def!$B$20,IF($T$5=4,Def!$B$64,\"\")))","v":"Certified"},null,null,{"$f":"Def!$B$39","v":"Yes"}]
[null,null,{"$f":"Def!$B$11:$B$15","v":"Company"},{"$f":"IF(Initial!$D$5:$D$9=\"\",\"\",Initial!$D$5:$D$9)","v":""},{"$nulls":4},{"$f":"Def!$B$17","v":"Switch-off criterion"},{"$f":"Initial!$J$6:$J$8","v":"Time (10 min)"},null,{"$f":"IF($O$5>\"\",\"\",Def!$B$25&\"   \"&IF($T$5=1,TEXT($S$39,\"0.0\"),IF($T$5=2,TEXT($S$38,\"0.0\"),IF($T$5=3,IF($W$5=$R$5,TEXT(Initial!$L$19,\"0.0\"),\"\"),\"\"))))","v":"Lower Limit   5.3"},{"$nulls":5},{"$f":"Def!$B$40","v":"No"}]
[null,null,"Instrument type","",{"$nulls":4},{"$f":"Def!$B$19","v":"Drying program"},"Standard",null,{"$f":"IF($O$5>\"\",\"\",Def!$B$26&\"   \"&IF($T$5=1,TEXT($S$37,\"0.0\"),IF($T$5=2,TEXT($S$36,\"0.0\"),IF($T$5=3,IF($W$5=$R$5,TEXT(Initial!$L$20,\"0.0\"),\"\"),\"\"))))","v":"Upper Limit   6.3"}]
[null,null,"Instrument ID","",{"$nulls":4},{"$f":"Def!$B$21","v":"Display mode"},"%MC",null,null,{"$f":"IF($T$5=\"\",\"\",IF(AND($I$4=$R$12,$O$7>0,$O$8>0,$O$8<$O$7),Def!$B$74,\"\"))","v":""},{"$nulls":4},"************"]
[null,null,"Location",""]
[null,null,"Contact Person","",{"$nulls":3},"Perform test with cold instrument."]
[]
[]
[{"$nulls":17},{"$f":"\"Control Limits: \"&IF(OR($T$5=1,$T$5=2),Def!$B$23,IF($T$5=4,Def!$B$57,\"\"))","v":"Control Limits: MT Control Limits"}]
[]
[]
[{"$nulls":17},"************"]
[]
[]
[{"$nulls":13},{"$f":"Def!$B$29","v":"Test Results %MCN"}]
[]
[{"$nulls":13},{"$f":"IF(AND($T$5=3,OR($O$7=\"\",$O$8=\"\")),\"\",$R$14)","v":"Control Limits: MT Control Limits"}]
[]
[]
[]
[{"$nulls":13},{"$f":"IF(OR($T$5=3,$T$5=4),$W$45,\"\")","v":""}]
[]
[]
[]
[]
[]
[{"$nulls":17},"************"]
[{"$nulls":17},{"$f":"Def!$B$9&\" \"&\"100°C\"","v":"Test temperature 100°C"}]
[]
[{"$nulls":17},"MT Calibration limits"]
[null,{"$f":"Def!$B$67","v":"Data reviewed by (signature and date)"},{"$nulls":5},{"$f":"Def!$B$71","v":"Reviewer's Comments"},{"$nulls":9},"Upper standard",{"$f":"TRANSPOSE(Def!$C$106:$F$106)","v":6.4}]
[{"$nulls":17},"Upper certified",6.3]
[{"$nulls":17},"Lower standard",5.2]
[{"$nulls":17},"Lower certified",5.3]
[]
[null,"SmartCalTM",null,{"$f":"Def!$B$6","v":"Performance test for Moisture Analyzer"},{"$nulls":6},{"$f":"$R$33","v":"Test temperature 100°C"}]
[{"$nulls":17},{"$f":"TODAY()","v":"2012-10-23"}]
[null,{"$f":"Def!$B$68","v":"Version 2.10   2012-03"}]
[null,{"$f":"Def!$B$31","v":"Date"},{"$f":"Def!$B$70","v":"SmartCal Lot No."},{"$f":"Def!$B$33","v":"Environmental conditions"},null,{"$f":"Def!$B$28","v":"Test Results"},null,null,{"$f":"Def!$B$42","v":"Remarks"},{"$nulls":4},{"$f":"Def!$B$44","v":"Name"}]
[{"$nulls":3},{"$f":"Def!$B$34","v":"%RH"},{"$f":"Def!$B$35","v":"°C"},{"$f":"Def!$B$36","v":"%MC"},{"$f":"Def!$B$37","v":"%MCN"},{"$f":"Def!$B$38","v":"Within Limits"},{"$f":"Def!$B$43","v":"e.g. Package damaged, adjustment done etc."},{"$nulls":10},"ENTRIES COMPLETE?","REPORTED ANSWERS","PLOTTED ANSWERS",{"$f":"Def!$B$54","v":"MT Control Limits (certified)"}]
[{"$nulls":17},"LOWER LIMIT","UPPER LIMIT",{"$nulls":3},"LOWER LIMIT","UPPER LIMIT"]
[1,{"$nulls":5},{"$f":"Result_100_2","v":""},{"$f":"WithinLimits_100","v":""},{"$nulls":9},{"$f":"IF($T$5=1,$S$39,IF($T$5=2,$S$38,IF($T$5=4,IF($M$9=\"\",$O$7,\"\"),IF(AND($T$5=3,$W$5=$R$5),Initial!$L$19,\"\"))))","v":{"v":5.3,"d":"5.30"}},{"$f":"IF($T$5=1,$S$37,IF($T$5=2,$S$36,IF($T$5=4,IF($M$9=\"\",$O$8,\"\"),IF(AND($T$5=3,$W$5=$R$5),Initial!$L$20,\"\"))))","v":{"v":6.3,"d":"6.30"}},{"$f":"AND($R$3,COUNTA($B47:$E47,$N47)=5)","v":false},{"$f":"CorrMC1_100","v":{"v":-0.3981778275591398,"d":"-0.40"}},{"$f":"Result_100_1","v":{"$error":"#N/A"}},{"$f":"IF($T$5=1,\"\",IF($T$5=2,\"\",IF($T$5=3,$S$39,IF($T$5=4,$S$39,\"\"))))","v":""},{"$f":"IF($T$5=1,\"\",IF($T$5=2,\"\",IF($T$5=3,$S$37,IF($T$5=4,$S$37,\"\"))))","v":""}]
[2,{"$nulls":5},"","",{"$nulls":9},{"$f":"IF($T$5=1,$S$39,IF($T$5=2,$S$38,IF($T$5=4,IF($M$9=\"\",$O$7,\"\"),IF(AND($T$5=3,$W$5=$R$5),Initial!$L$19,\"\"))))","v":{"v":5.3,"d":"5.30"}},{"$f":"IF($T$5=1,$S$37,IF($T$5=2,$S$36,IF($T$5=4,IF($M$9=\"\",$O$8,\"\"),IF(AND($T$5=3,$W$5=$R$5),Initial!$L$20,\"\"))))","v":{"v":6.3,"d":"6.30"}},{"$f":"AND($R$3,COUNTA($B48:$E48,$N48)=5)","v":false},{"v":-0.3981778275591398,"d":"-0.40"},{"$error":"#N/A"},{"$f":"IF($T$5=1,\"\",IF($T$5=2,\"\",IF($T$5=3,$S$39,IF($T$5=4,$S$39,\"\"))))","v":""},{"$f":"IF($T$5=1,\"\",IF($T$5=2,\"\",IF($T$5=3,$S$37,IF($T$5=4,$S$37,\"\"))))","v":""}]
[3,{"$nulls":5},"","",{"$nulls":9},{"$f":"IF($T$5=1,$S$39,IF($T$5=2,$S$38,IF($T$5=4,IF($M$9=\"\",$O$7,\"\"),IF(AND($T$5=3,$W$5=$R$5),Initial!$L$19,\"\"))))","v":{"v":5.3,"d":"5.30"}},{"$f":"IF($T$5=1,$S$37,IF($T$5=2,$S$36,IF($T$5=4,IF($M$9=\"\",$O$8,\"\"),IF(AND($T$5=3,$W$5=$R$5),Initial!$L$20,\"\"))))","v":{"v":6.3,"d":"6.30"}},false,{"v":-0.3981778275591398,"d":"-0.40"},{"$error":"#N/A"},"",""]
[4,{"$nulls":5},"","",{"$nulls":9},{"$f":"IF($T$5=1,$S$39,IF($T$5=2,$S$38,IF($T$5=4,IF($M$9=\"\",$O$7,\"\"),IF(AND($T$5=3,$W$5=$R$5),Initial!$L$19,\"\"))))","v":{"v":5.3,"d":"5.30"}},{"$f":"IF($T$5=1,$S$37,IF($T$5=2,$S$36,IF($T$5=4,IF($M$9=\"\",$O$8,\"\"),IF(AND($T$5=3,$W$5=$R$5),Initial!$L$20,\"\"))))","v":{"v":6.3,"d":"6.30"}},false,{"v":-0.3981778275591398,"d":"-0.40"},{"$error":"#N/A"},"",""]
[5,{"$nulls":5},"","",{"$nulls":9},{"$f":"IF($T$5=1,$S$39,IF($T$5=2,$S$38,IF($T$5=4,IF($M$9=\"\",$O$7,\"\"),IF(AND($T$5=3,$W$5=$R$5),Initial!$L$19,\"\"))))","v":{"v":5.3,"d":"5.30"}},{"$f":"IF($T$5=1,$S$37,IF($T$5=2,$S$36,IF($T$5=4,IF($M$9=\"\",$O$8,\"\"),IF(AND($T$5=3,$W$5=$R$5),Initial!$L$20,\"\"))))","v":{"v":6.3,"d":"6.30"}},false,{"v":-0.3981778275591398,"d":"-0.40"},{"$error":"#N/A"},"",""]
[6,{"$nulls":5},"","",{"$nulls":9},{"$f":"IF($T$5=1,$S$39,IF($T$5=2,$S$38,IF($T$5=4,IF($M$9=\"\",$O$7,\"\"),IF(AND($T$5=3,$W$5=$R$5),Initial!$L$19,\"\"))))","v":{"v":5.3,"d":"5.30"}},{"$f":"IF($T$5=1,$S$37,IF($T$5=2,$S$36,IF($T$5=4,IF($M$9=\"\",$O$8,\"\"),IF(AND($T$5=3,$W$5=$R$5),Initial!$L$20,\"\"))))","v":{"v":6.3,"d":"6.30"}},false,{"v":-0.3981778275591398,"d":"-0.40"},{"$error":"#N/A"},"",""]
[7,{"$nulls":5},"","",{"$nulls":9},{"$f":"IF($T$5=1,$S$39,IF($T$5=2,$S$38,IF($T$5=4,IF($M$9=\"\",$O$7,\"\"),IF(AND($T$5=3,$W$5=$R$5),Initial!$L$19,\"\"))))","v":{"v":5.3,"d":"5.30"}},{"$f":"IF($T$5=1,$S$37,IF($T$5=2,$S$36,IF($T$5=4,IF($M$9=\"\",$O$8,\"\"),IF(AND($T$5=3,$W$5=$R$5),Initial!$L$20,\"\"))))","v":{"v":6.3,"d":"6.30"}},false,{"v":-0.3981778275591398,"d":"-0.40"},{"$error":"#N/A"},"",""]
[8,{"$nulls":5},"","",{"$nulls":9},{"$f":"IF($T$5=1,$S$39,IF($T$5=2,$S$38,IF($T$5=4,IF($M$9=\"\",$O$7,\"\"),IF(AND($T$5=3,$W$5=$R$5),Initial!$L$19,\"\"))))","v":{"v":5.3,"d":"5.30"}},{"$f":"IF($T$5=1,$S$37,IF($T$5=2,$S$36,IF($T$5=4,IF($M$9=\"\",$O$8,\"\"),IF(AND($T$5=3,$W$5=$R$5),Initial!$L$20,\"\"))))","v":{"v":6.3,"d":"6.30"}},false,{"v":-0.3981778275591398,"d":"-0.40"},{"$error":"#N/A"},"",""]
[9,{"$nulls":5},"","",{"$nulls":9},{"$f":"IF($T$5=1,$S$39,IF($T$5=2,$S$38,IF($T$5=4,IF($M$9=\"\",$O$7,\"\"),IF(AND($T$5=3,$W$5=$R$5),Initial!$L$19,\"\"))))","v":{"v":5.3,"d":"5.30"}},{"$f":"IF($T$5=1,$S$37,IF($T$5=2,$S$36,IF($T$5=4,IF($M$9=\"\",$O$8,\"\"),IF(AND($T$5=3,$W$5=$R$5),Initial!$L$20,\"\"))))","v":{"v":6.3,"d":"6.30"}},false,{"v":-0.3981778275591398,"d":"-0.40"},{"$error":"#N/A"},"",""]
[10,{"$nulls":5},"","",{"$nulls":9},{"$f":"IF($T$5=1,$S$39,IF($T$5=2,$S$38,IF($T$5=4,IF($M$9=\"\",$O$7,\"\"),IF(AND($T$5=3,$W$5=$R$5),Initial!$L$19,\"\"))))","v":{"v":5.3,"d":"5.30"}},{"$f":"IF($T$5=1,$S$37,IF($T$5=2,$S$36,IF($T$5=4,IF($M$9=\"\",$O$8,\"\"),IF(AND($T$5=3,$W$5=$R$5),Initial!$L$20,\"\"))))","v":{"v":6.3,"d":"6.30"}},false,{"v":-0.3981778275591398,"d":"-0.40"},{"$error":"#N/A"},"",""]
[11,{"$nulls":5},"","",{"$nulls":9},{"$f":"IF($T$5=1,$S$39,IF($T$5=2,$S$38,IF($T$5=4,IF($M$9=\"\",$O$7,\"\"),IF(AND($T$5=3,$W$5=$R$5),Initial!$L$19,\"\"))))","v":{"v":5.3,"d":"5.30"}},{"$f":"IF($T$5=1,$S$37,IF($T$5=2,$S$36,IF($T$5=4,IF($M$9=\"\",$O$8,\"\"),IF(AND($T$5=3,$W$5=$R$5),Initial!$L$20,\"\"))))","v":{"v":6.3,"d":"6.30"}},false,{"v":-0.3981778275591398,"d":"-0.40"},{"$error":"#N/A"},"",""]
[12,{"$nulls":5},"","",{"$nulls":9},{"$f":"IF($T$5=1,$S$39,IF($T$5=2,$S$38,IF($T$5=4,IF($M$9=\"\",$O$7,\"\"),IF(AND($T$5=3,$W$5=$R$5),Initial!$L$19,\"\"))))","v":{"v":5.3,"d":"5.30"}},{"$f":"IF($T$5=1,$S$37,IF($T$5=2,$S$36,IF($T$5=4,IF($M$9=\"\",$O$8,\"\"),IF(AND($T$5=3,$W$5=$R$5),Initial!$L$20,\"\"))))","v":{"v":6.3,"d":"6.30"}},false,{"v":-0.3981778275591398,"d":"-0.40"},{"$error":"#N/A"},"",""]
[13,{"$nulls":5},"","",{"$nulls":9},{"$f":"IF($T$5=1,$S$39,IF($T$5=2,$S$38,IF($T$5=4,IF($M$9=\"\",$O$7,\"\"),IF(AND($T$5=3,$W$5=$R$5),Initial!$L$19,\"\"))))","v":{"v":5.3,"d":"5.30"}},{"$f":"IF($T$5=1,$S$37,IF($T$5=2,$S$36,IF($T$5=4,IF($M$9=\"\",$O$8,\"\"),IF(AND($T$5=3,$W$5=$R$5),Initial!$L$20,\"\"))))","v":{"v":6.3,"d":"6.30"}},false,{"v":-0.3981778275591398,"d":"-0.40"},{"$error":"#N/A"},"",""]
[14,{"$nulls":5},"","",{"$nulls":9},{"$f":"IF($T$5=1,$S$39,IF($T$5=2,$S$38,IF($T$5=4,IF($M$9=\"\",$O$7,\"\"),IF(AND($T$5=3,$W$5=$R$5),Initial!$L$19,\"\"))))","v":{"v":5.3,"d":"5.30"}},{"$f":"IF($T$5=1,$S$37,IF($T$5=2,$S$36,IF($T$5=4,IF($M$9=\"\",$O$8,\"\"),IF(AND($T$5=3,$W$5=$R$5),Initial!$L$20,\"\"))))","v":{"v":6.3,"d":"6.30"}},false,{"v":-0.3981778275591398,"d":"-0.40"},{"$error":"#N/A"},"",""]
[15,{"$nulls":5},"","",{"$nulls":9},{"$f":"IF($T$5=1,$S$39,IF($T$5=2,$S$38,IF($T$5=4,IF($M$9=\"\",$O$7,\"\"),IF(AND($T$5=3,$W$5=$R$5),Initial!$L$19,\"\"))))","v":{"v":5.3,"d":"5.30"}},{"$f":"IF($T$5=1,$S$37,IF($T$5=2,$S$36,IF($T$5=4,IF($M$9=\"\",$O$8,\"\"),IF(AND($T$5=3,$W$5=$R$5),Initial!$L$20,\"\"))))","v":{"v":6.3,"d":"6.30"}},false,{"v":-0.3981778275591398,"d":"-0.40"},{"$error":"#N/A"},"",""]
[16,{"$nulls":5},"","",{"$nulls":9},{"$f":"IF($T$5=1,$S$39,IF($T$5=2,$S$38,IF($T$5=4,IF($M$9=\"\",$O$7,\"\"),IF(AND($T$5=3,$W$5=$R$5),Initial!$L$19,\"\"))))","v":{"v":5.3,"d":"5.30"}},{"$f":"IF($T$5=1,$S$37,IF($T$5=2,$S$36,IF($T$5=4,IF($M$9=\"\",$O$8,\"\"),IF(AND($T$5=3,$W$5=$R$5),Initial!$L$20,\"\"))))","v":{"v":6.3,"d":"6.30"}},false,{"v":-0.3981778275591398,"d":"-0.40"},{"$error":"#N/A"},"",""]
[17,{"$nulls":5},"","",{"$nulls":9},{"$f":"IF($T$5=1,$S$39,IF($T$5=2,$S$38,IF($T$5=4,IF($M$9=\"\",$O$7,\"\"),IF(AND($T$5=3,$W$5=$R$5),Initial!$L$19,\"\"))))","v":{"v":5.3,"d":"5.30"}},{"$f":"IF($T$5=1,$S$37,IF($T$5=2,$S$36,IF($T$5=4,IF($M$9=\"\",$O$8,\"\"),IF(AND($T$5=3,$W$5=$R$5),Initial!$L$20,\"\"))))","v":{"v":6.3,"d":"6.30"}},false,{"v":-0.3981778275591398,"d":"-0.40"},{"$error":"#N/A"},"",""]
[18,{"$nulls":5},"","",{"$nulls":9},{"$f":"IF($T$5=1,$S$39,IF($T$5=2,$S$38,IF($T$5=4,IF($M$9=\"\",$O$7,\"\"),IF(AND($T$5=3,$W$5=$R$5),Initial!$L$19,\"\"))))","v":{"v":5.3,"d":"5.30"}},{"$f":"IF($T$5=1,$S$37,IF($T$5=2,$S$36,IF($T$5=4,IF($M$9=\"\",$O$8,\"\"),IF(AND($T$5=3,$W$5=$R$5),Initial!$L$20,\"\"))))","v":{"v":6.3,"d":"6.30"}},false,{"v":-0.3981778275591398,"d":"-0.40"},{"$error":"#N/A"},"",""]
[19,{"$nulls":5},"","",{"$nulls":9},{"$f":"IF($T$5=1,$S$39,IF($T$5=2,$S$38,IF($T$5=4,IF($M$9=\"\",$O$7,\"\"),IF(AND($T$5=3,$W$5=$R$5),Initial!$L$19,\"\"))))","v":{"v":5.3,"d":"5.30"}},{"$f":"IF($T$5=1,$S$37,IF($T$5=2,$S$36,IF($T$5=4,IF($M$9=\"\",$O$8,\"\"),IF(AND($T$5=3,$W$5=$R$5),Initial!$L$20,\"\"))))","v":{"v":6.3,"d":"6.30"}},false,{"v":-0.3981778275591398,"d":"-0.40"},{"$error":"#N/A"},"",""]
[20,{"$nulls":5},"","",{"$nulls":9},{"$f":"IF($T$5=1,$S$39,IF($T$5=2,$S$38,IF($T$5=4,IF($M$9=\"\",$O$7,\"\"),IF(AND($T$5=3,$W$5=$R$5),Initial!$L$19,\"\"))))","v":{"v":5.3,"d":"5.30"}},{"$f":"IF($T$5=1,$S$37,IF($T$5=2,$S$36,IF($T$5=4,IF($M$9=\"\",$O$8,\"\"),IF(AND($T$5=3,$W$5=$R$5),Initial!$L$20,\"\"))))","v":{"v":6.3,"d":"6.30"}},false,{"v":-0.3981778275591398,"d":"-0.40"},{"$error":"#N/A"},"",""]
[21,{"$nulls":5},"","",{"$nulls":9},{"$f":"IF($T$5=1,$S$39,IF($T$5=2,$S$38,IF($T$5=4,IF($M$9=\"\",$O$7,\"\"),IF(AND($T$5=3,$W$5=$R$5),Initial!$L$19,\"\"))))","v":{"v":5.3,"d":"5.30"}},{"$f":"IF($T$5=1,$S$37,IF($T$5=2,$S$36,IF($T$5=4,IF($M$9=\"\",$O$8,\"\"),IF(AND($T$5=3,$W$5=$R$5),Initial!$L$20,\"\"))))","v":{"v":6.3,"d":"6.30"}},false,{"v":-0.3981778275591398,"d":"-0.40"},{"$error":"#N/A"},"",""]
[22,{"$nulls":5},"","",{"$nulls":9},{"$f":"IF($T$5=1,$S$39,IF($T$5=2,$S$38,IF($T$5=4,IF($M$9=\"\",$O$7,\"\"),IF(AND($T$5=3,$W$5=$R$5),Initial!$L$19,\"\"))))","v":{"v":5.3,"d":"5.30"}},{"$f":"IF($T$5=1,$S$37,IF($T$5=2,$S$36,IF($T$5=4,IF($M$9=\"\",$O$8,\"\"),IF(AND($T$5=3,$W$5=$R$5),Initial!$L$20,\"\"))))","v":{"v":6.3,"d":"6.30"}},false,{"v":-0.3981778275591398,"d":"-0.40"},{"$error":"#N/A"},"",""]
[23,{"$nulls":5},"","",{"$nulls":9},{"$f":"IF($T$5=1,$S$39,IF($T$5=2,$S$38,IF($T$5=4,IF($M$9=\"\",$O$7,\"\"),IF(AND($T$5=3,$W$5=$R$5),Initial!$L$19,\"\"))))","v":{"v":5.3,"d":"5.30"}},{"$f":"IF($T$5=1,$S$37,IF($T$5=2,$S$36,IF($T$5=4,IF($M$9=\"\",$O$8,\"\"),IF(AND($T$5=3,$W$5=$R$5),Initial!$L$20,\"\"))))","v":{"v":6.3,"d":"6.30"}},false,{"v":-0.3981778275591398,"d":"-0.40"},{"$error":"#N/A"},"",""]
[24,{"$nulls":5},"","",{"$nulls":9},{"$f":"IF($T$5=1,$S$39,IF($T$5=2,$S$38,IF($T$5=4,IF($M$9=\"\",$O$7,\"\"),IF(AND($T$5=3,$W$5=$R$5),Initial!$L$19,\"\"))))","v":{"v":5.3,"d":"5.30"}},{"$f":"IF($T$5=1,$S$37,IF($T$5=2,$S$36,IF($T$5=4,IF($M$9=\"\",$O$8,\"\"),IF(AND($T$5=3,$W$5=$R$5),Initial!$L$20,\"\"))))","v":{"v":6.3,"d":"6.30"}},false,{"v":-0.3981778275591398,"d":"-0.40"},{"$error":"#N/A"},"",""]
[]
[null,{"$f":"Def!$B$67","v":"Data reviewed by (signature and date)"},{"$nulls":4},{"$f":"Def!$B$71","v":"Reviewer's Comments"}]

{"sheet":"Report 130°C","index":3,"n_rows":72,"n_cols":24,"rows_kept":72,"merged":[[0,1,1,2],[0,3,1,9],[2,3,2,9],[2,19,3,19],[2,20,3,20],[2,21,3,22],[3,8,3,14],[5,1,5,4],[5,7,5,8],[5,10,5,13],[5,14,5,15],[6,11,6,13],[7,11,7,13],[8,12,9,14],[10,7,10,9],[10,12,15,14],[11,7,12,9],[19,13,20,14],[21,13,24,14],[25,13,26,14],[36,1,38,5],[36,7,38,11],[40,1,41,2],[40,3,41,9],[40,10,41,14],[43,1,45,1],[43,2,45,2],[43,3,43,4],[43,5,43,7],[43,8,43,12],[43,13,45,14],[44,3,45,3],[44,4,45,4],[44,5,45,5],[44,6,45,6],[44,7,45,7],[44,8,45,12],[44,19,45,19],[44,20,45,20],[44,21,45,21],[44,22,44,23],[46,8,46,12],[46,13,46,14],[47,8,47,12],[47,13,47,14],[48,8,48,12],[48,13,48,14],[49,8,49,12],[49,13,49,14],[50,8,50,12],[50,13,50,14],[51,8,51,12],[51,13,51,14],[52,8,52,12],[52,13,52,14],[53,8,53,12],[53,13,53,14],[54,8,54,12],[54,13,54,14],[55,8,55,12],[55,13,55,14],[56,8,56,12],[56,13,56,14],[57,8,57,12],[57,13,57,14],[58,8,58,12],[58,13,58,14],[59,8,59,12],[59,13,59,14],[60,8,60,12],[60,13,60,14],[61,8,61,12],[61,13,61,14],[62,8,62,12],[62,13,62,14],[63,8,63,12],[63,13,63,14],[64,8,64,12],[64,13,64,14],[65,8,65,12],[65,13,65,14],[66,8,66,12],[66,13,66,14],[67,8,67,12],[67,13,67,14],[68,8,68,12],[68,13,68,14],[69,8,69,12],[69,13,69,14],[71,1,71,4],[71,6,71,10],[72,1,74,4],[72,6,74,11]]}
[null,"SmartCalTM",null,{"$f":"Def!$B$6","v":"Performance test for Moisture Analyzer"}]
[{"$nulls":17},"Are D7 to D11 complete?"]
[null,{"$f":"Def!$B$68","v":"Version 2.10   2012-03"},null,{"$f":"$R$33","v":"Test temperature 130°C"},{"$nulls":13},{"$f":"(OR(AND(OR($T$5=1,$T$5=2,$T$5=3),$S$3+COUNTA($O$7:$O$8)=5),AND($T$5=4,COUNT($O$7:$O$8)=2,$S$3=5)))","v":false},{"$f":"COUNTA(Initial!D5:E9)","v":0},"Control limits Source","Selected Language","Selected Temperature"]
[{"$nulls":17},"Temperature number"]
[{"$nulls":14},{"$f":"IF($T$5=\"\",\"\",IF(AND(OR($T$5<4,$T$5>4),COUNTA($O$7:$O$8)>0),Def!$B$73,\"\"))","v":""},null,null,3,null,{"$f":"Initial!$P$11","v":1},{"$f":"Initial!$P$2","v":1},{"$f":"Initial!$P$5","v":"100°C"},{"$f":"Initial!$P$4","v":2}]
[null,{"$f":"Def!$B$10","v":"Instrument identification"},{"$nulls":5},{"$f":"Def!$B$16","v":"Testing parameter"},null,null,{"$f":"IF(OR($T$5=1,$T$5=2),Def!$B$24,\"\")","v":"MT Control Limits [%MC]"},{"$nulls":3},{"$f":"IF($T$5=1,Def!$B$63,IF($T$5=2,Def!$B$20,IF($T$5=4,Def!$B$64,\"\")))","v":"Certified"},null,null,{"$f":"Def!$B$39","v":"Yes"}]
[null,null,{"$f":"Def!$B$11:$B$15","v":"Company"},{"$f":"IF(Initial!$D$5:$D$9=\"\",\"\",Initial!$D$5:$D$9)","v":""},{"$nulls":4},{"$f":"Def!$B$17","v":"Switch-off criterion"},{"$f":"Initial!$J$6:$J$8","v":"Time (10 min)"},null,{"$f":"IF($O$5>\"\",\"\",Def!$B$25&\"   \"&IF($T$5=1,TEXT($S$39,\"0.0\"),IF($T$5=2,TEXT($S$38,\"0.0\"),IF($T$5=3,IF($W$5=$R$5,TEXT(Initial!$L$19,\"0.0\"),\"\"),\"\"))))","v":"Lower Limit   7.5"},{"$nulls":5},{"$f":"Def!$B$40","v":"No"}]
[null,null,"Instrument type","",{"$nulls":4},{"$f":"Def!$B$19","v":"Drying program"},"Standard",null,{"$f":"IF($O$5>\"\",\"\",Def!$B$26&\"   \"&IF($T$5=1,TEXT($S$37,\"0.0\"),IF($T$5=2,TEXT($S$36,\"0.0\"),IF($T$5=3,IF($W$5=$R$5,TEXT(Initial!$L$20,\"0.0\"),\"\"),\"\"))))","v":"Upper Limit   8.7"}]
[null,null,"Instrument ID","",{"$nulls":4},{"$f":"Def!$B$21","v":"Display mode"},"%MC",null,null,{"$f":"IF($T$5=\"\",\"\",IF(AND($I$4=$R$12,$O$7>0,$O$8>0,$O$8<$O$7),Def!$B$74,\"\"))","v":""},{"$nulls":4},"************"]
[null,null,"Location",""]
[null,null,"Contact Person","",{"$nulls":3},"Perform test with cold instrument."]
[]
[]
[{"$nulls":17},{"$f":"\"Control Limits: \"&IF(OR($T$5=1,$T$5=2),Def!$B$23,IF($T$5=4,Def!$B$57,\"\"))","v":"Control Limits: MT Control Limits"}]
[]
[]
[{"$nulls":17},"************"]
[]
[]
[{"$nulls":13},{"$f":"Def!$B$29","v":"Test Results %MCN"}]
[]
[{"$nulls":13},{"$f":"IF(AND($T$5=3,OR($O$7=\"\",$O$8=\"\")),\"\",$R$14)","v":"Control Limits: MT Control Limits"}]
[]
[]
[]
[{"$nulls":13},{"$f":"IF(OR($T$5=3,$T$5=4),$W$45,\"\")","v":""}]
[]
[]
[]
[]
[]
[{"$nulls":17},"************"]
[{"$nulls":17},{"$f":"Def!$B$9&\" \"&\"130°C\"","v":"Test temperature 130°C"}]
[]
[{"$nulls":17},"MT Calibration limits"]
[null,{"$f":"Def!$B$67","v":"Data reviewed by (signature and date)"},{"$nulls":5},{"$f":"Def!$B$71","v":"Reviewer's Comments"},{"$nulls":9},"Upper standard",{"$f":"TRANSPOSE(Def!$C$107:$F$107)","v":8.8}]
[{"$nulls":17},"Upper certified",8.7]
[{"$nulls":17},"Lower standard",7.4]
[{"$nulls":17},"Lower certified",7.5]
[]
[null,"SmartCalTM",null,{"$f":"Def!$B$6","v":"Performance test for Moisture Analyzer"},{"$nulls":6},{"$f":"$R$33","v":"Test temperature 130°C"}]
[{"$nulls":17},{"$f":"TODAY()","v":"2012-10-23"}]
[null,{"$f":"Def!$B$68","v":"Version 2.10   2012-03"}]
[null,{"$f":"Def!$B$31","v":"Date"},{"$f":"Def!$B$70","v":"SmartCal Lot No."},{"$f":"Def!$B$33","v":"Environmental conditions"},null,{"$f":"Def!$B$28","v":"Test Results"},null,null,{"$f":"Def!$B$42","v":"Remarks"},{"$nulls":4},{"$f":"Def!$B$44","v":"Name"}]
[{"$nulls":3},{"$f":"Def!$B$34","v":"%RH"},{"$f":"Def!$B$35","v":"°C"},{"$f":"Def!$B$36","v":"%MC"},{"$f":"Def!$B$37","v":"%MCN"},{"$f":"Def!$B$38","v":"Within Limits"},{"$f":"Def!$B$43","v":"e.g. Package damaged, adjustment done etc."},{"$nulls":10},"ENTRIES COMPLETE?","REPORTED ANSWERS","PLOTTED ANSWERS",{"$f":"Def!$B$54","v":"MT Control Limits (certified)"}]
[{"$nulls":17},"LOWER LIMIT","UPPER LIMIT",{"$nulls":3},"LOWER LIMIT","UPPER LIMIT"]
[1,{"$nulls":5},{"$f":"Result_130_2","v":""},{"$f":"WithinLimits_130","v":""},{"$nulls":9},{"$f":"IF($T$5=1,$S$39,IF($T$5=2,$S$38,IF($T$5=4,IF($M$9=\"\",$O$7,\"\"),IF(AND($T$5=3,$W$5=$R$5),Initial!$L$19,\"\"))))","v":{"v":7.5,"d":"7.50"}},{"$f":"IF($T$5=1,$S$37,IF($T$5=2,$S$36,IF($T$5=4,IF($M$9=\"\",$O$8,\"\"),IF(AND($T$5=3,$W$5=$R$5),Initial!$L$20,\"\"))))","v":{"v":8.7,"d":"8.70"}},{"$f":"AND($R$3,COUNTA($B47:$E47,$N47)=5)","v":false},{"$f":"CorrMC1_130","v":{"v":-0.3981778275591398,"d":"-0.40"}},{"$f":"Result_130_1","v":{"$error":"#N/A"}},{"$f":"IF($T$5=1,\"\",IF($T$5=2,\"\",IF($T$5=3,$S$39,IF($T$5=4,$S$39,\"\"))))","v":""},{"$f":"IF($T$5=1,\"\",IF($T$5=2,\"\",IF($T$5=3,$S$37,IF($T$5=4,$S$37,\"\"))))","v":""}]
[2,{"$nulls":5},"","",{"$nulls":9},{"$f":"IF($T$5=1,$S$39,IF($T$5=2,$S$38,IF($T$5=4,IF($M$9=\"\",$O$7,\"\"),IF(AND($T$5=3,$W$5=$R$5),Initial!$L$19,\"\"))))","v":{"v":7.5,"d":"7.50"}},{"$f":"IF($T$5=1,$S$37,IF($T$5=2,$S$36,IF($T$5=4,IF($M$9=\"\",$O$8,\"\"),IF(AND($T$5=3,$W$5=$R$5),Initial!$L$20,\"\"))))","v":{"v":8.7,"d":"8.70"}},{"$f":"AND($R$3,COUNTA($B48:$E48,$N48)=5)","v":false},{"v":-0.3981778275591398,"d":"-0.40"},{"$error":"#N/A"},{"$f":"IF($T$5=1,\"\",IF($T$5=2,\"\",IF($T$5=3,$S$39,IF($T$5=4,$S$39,\"\"))))","v":""},{"$f":"IF($T$5=1,\"\",IF($T$5=2,\"\",IF($T$5=3,$S$37,IF($T$5=4,$S$37,\"\"))))","v":""}]
[3,{"$nulls":5},"","",{"$nulls":9},{"$f":"IF($T$5=1,$S$39,IF($T$5=2,$S$38,IF($T$5=4,IF($M$9=\"\",$O$7,\"\"),IF(AND($T$5=3,$W$5=$R$5),Initial!$L$19,\"\"))))","v":{"v":7.5,"d":"7.50"}},{"$f":"IF($T$5=1,$S$37,IF($T$5=2,$S$36,IF($T$5=4,IF($M$9=\"\",$O$8,\"\"),IF(AND($T$5=3,$W$5=$R$5),Initial!$L$20,\"\"))))","v":{"v":8.7,"d":"8.70"}},false,{"v":-0.3981778275591398,"d":"-0.40"},{"$error":"#N/A"},"",""]
[4,{"$nulls":5},"","",{"$nulls":9},{"$f":"IF($T$5=1,$S$39,IF($T$5=2,$S$38,IF($T$5=4,IF($M$9=\"\",$O$7,\"\"),IF(AND($T$5=3,$W$5=$R$5),Initial!$L$19,\"\"))))","v":{"v":7.5,"d":"7.50"}},{"$f":"IF($T$5=1,$S$37,IF($T$5=2,$S$36,IF($T$5=4,IF($M$9=\"\",$O$8,\"\"),IF(AND($T$5=3,$W$5=$R$5),Initial!$L$20,\"\"))))","v":{"v":8.7,"d":"8.70"}},false,{"v":-0.3981778275591398,"d":"-0.40"},{"$error":"#N/A"},"",""]
[5,{"$nulls":5},"","",{"$nulls":9},{"$f":"IF($T$5=1,$S$39,IF($T$5=2,$S$38,IF($T$5=4,IF($M$9=\"\",$O$7,\"\"),IF(AND($T$5=3,$W$5=$R$5),Initial!$L$19,\"\"))))","v":{"v":7.5,"d":"7.50"}},{"$f":"IF($T$5=1,$S$37,IF($T$5=2,$S$36,IF($T$5=4,IF($M$9=\"\",$O$8,\"\"),IF(AND($T$5=3,$W$5=$R$5),Initial!$L$20,\"\"))))","v":{"v":8.7,"d":"8.70"}},false,{"v":-0.3981778275591398,"d":"-0.40"},{"$error":"#N/A"},"",""]
[6,{"$nulls":5},"","",{"$nulls":9},{"$f":"IF($T$5=1,$S$39,IF($T$5=2,$S$38,IF($T$5=4,IF($M$9=\"\",$O$7,\"\"),IF(AND($T$5=3,$W$5=$R$5),Initial!$L$19,\"\"))))","v":{"v":7.5,"d":"7.50"}},{"$f":"IF($T$5=1,$S$37,IF($T$5=2,$S$36,IF($T$5=4,IF($M$9=\"\",$O$8,\"\"),IF(AND($T$5=3,$W$5=$R$5),Initial!$L$20,\"\"))))","v":{"v":8.7,"d":"8.70"}},false,{"v":-0.3981778275591398,"d":"-0.40"},{"$error":"#N/A"},"",""]
[7,{"$nulls":5},"","",{"$nulls":9},{"$f":"IF($T$5=1,$S$39,IF($T$5=2,$S$38,IF($T$5=4,IF($M$9=\"\",$O$7,\"\"),IF(AND($T$5=3,$W$5=$R$5),Initial!$L$19,\"\"))))","v":{"v":7.5,"d":"7.50"}},{"$f":"IF($T$5=1,$S$37,IF($T$5=2,$S$36,IF($T$5=4,IF($M$9=\"\",$O$8,\"\"),IF(AND($T$5=3,$W$5=$R$5),Initial!$L$20,\"\"))))","v":{"v":8.7,"d":"8.70"}},false,{"v":-0.3981778275591398,"d":"-0.40"},{"$error":"#N/A"},"",""]
[8,{"$nulls":5},"","",{"$nulls":9},{"$f":"IF($T$5=1,$S$39,IF($T$5=2,$S$38,IF($T$5=4,IF($M$9=\"\",$O$7,\"\"),IF(AND($T$5=3,$W$5=$R$5),Initial!$L$19,\"\"))))","v":{"v":7.5,"d":"7.50"}},{"$f":"IF($T$5=1,$S$37,IF($T$5=2,$S$36,IF($T$5=4,IF($M$9=\"\",$O$8,\"\"),IF(AND($T$5=3,$W$5=$R$5),Initial!$L$20,\"\"))))","v":{"v":8.7,"d":"8.70"}},false,{"v":-0.3981778275591398,"d":"-0.40"},{"$error":"#N/A"},"",""]
[9,{"$nulls":5},"","",{"$nulls":9},{"$f":"IF($T$5=1,$S$39,IF($T$5=2,$S$38,IF($T$5=4,IF($M$9=\"\",$O$7,\"\"),IF(AND($T$5=3,$W$5=$R$5),Initial!$L$19,\"\"))))","v":{"v":7.5,"d":"7.50"}},{"$f":"IF($T$5=1,$S$37,IF($T$5=2,$S$36,IF($T$5=4,IF($M$9=\"\",$O$8,\"\"),IF(AND($T$5=3,$W$5=$R$5),Initial!$L$20,\"\"))))","v":{"v":8.7,"d":"8.70"}},false,{"v":-0.3981778275591398,"d":"-0.40"},{"$error":"#N/A"},"",""]
[10,{"$nulls":5},"","",{"$nulls":9},{"$f":"IF($T$5=1,$S$39,IF($T$5=2,$S$38,IF($T$5=4,IF($M$9=\"\",$O$7,\"\"),IF(AND($T$5=3,$W$5=$R$5),Initial!$L$19,\"\"))))","v":{"v":7.5,"d":"7.50"}},{"$f":"IF($T$5=1,$S$37,IF($T$5=2,$S$36,IF($T$5=4,IF($M$9=\"\",$O$8,\"\"),IF(AND($T$5=3,$W$5=$R$5),Initial!$L$20,\"\"))))","v":{"v":8.7,"d":"8.70"}},false,{"v":-0.3981778275591398,"d":"-0.40"},{"$error":"#N/A"},"",""]
[11,{"$nulls":5},"","",{"$nulls":9},{"$f":"IF($T$5=1,$S$39,IF($T$5=2,$S$38,IF($T$5=4,IF($M$9=\"\",$O$7,\"\"),IF(AND($T$5=3,$W$5=$R$5),Initial!$L$19,\"\"))))","v":{"v":7.5,"d":"7.50"}},{"$f":"IF($T$5=1,$S$37,IF($T$5=2,$S$36,IF($T$5=4,IF($M$9=\"\",$O$8,\"\"),IF(AND($T$5=3,$W$5=$R$5),Initial!$L$20,\"\"))))","v":{"v":8.7,"d":"8.70"}},false,{"v":-0.3981778275591398,"d":"-0.40"},{"$error":"#N/A"},"",""]
[12,{"$nulls":5},"","",{"$nulls":9},{"$f":"IF($T$5=1,$S$39,IF($T$5=2,$S$38,IF($T$5=4,IF($M$9=\"\",$O$7,\"\"),IF(AND($T$5=3,$W$5=$R$5),Initial!$L$19,\"\"))))","v":{"v":7.5,"d":"7.50"}},{"$f":"IF($T$5=1,$S$37,IF($T$5=2,$S$36,IF($T$5=4,IF($M$9=\"\",$O$8,\"\"),IF(AND($T$5=3,$W$5=$R$5),Initial!$L$20,\"\"))))","v":{"v":8.7,"d":"8.70"}},false,{"v":-0.3981778275591398,"d":"-0.40"},{"$error":"#N/A"},"",""]
[13,{"$nulls":5},"","",{"$nulls":9},{"$f":"IF($T$5=1,$S$39,IF($T$5=2,$S$38,IF($T$5=4,IF($M$9=\"\",$O$7,\"\"),IF(AND($T$5=3,$W$5=$R$5),Initial!$L$19,\"\"))))","v":{"v":7.5,"d":"7.50"}},{"$f":"IF($T$5=1,$S$37,IF($T$5=2,$S$36,IF($T$5=4,IF($M$9=\"\",$O$8,\"\"),IF(AND($T$5=3,$W$5=$R$5),Initial!$L$20,\"\"))))","v":{"v":8.7,"d":"8.70"}},false,{"v":-0.3981778275591398,"d":"-0.40"},{"$error":"#N/A"},"",""]
[14,{"$nulls":5},"","",{"$nulls":9},{"$f":"IF($T$5=1,$S$39,IF($T$5=2,$S$38,IF($T$5=4,IF($M$9=\"\",$O$7,\"\"),IF(AND($T$5=3,$W$5=$R$5),Initial!$L$19,\"\"))))","v":{"v":7.5,"d":"7.50"}},{"$f":"IF($T$5=1,$S$37,IF($T$5=2,$S$36,IF($T$5=4,IF($M$9=\"\",$O$8,\"\"),IF(AND($T$5=3,$W$5=$R$5),Initial!$L$20,\"\"))))","v":{"v":8.7,"d":"8.70"}},false,{"v":-0.3981778275591398,"d":"-0.40"},{"$error":"#N/A"},"",""]
[15,{"$nulls":5},"","",{"$nulls":9},{"$f":"IF($T$5=1,$S$39,IF($T$5=2,$S$38,IF($T$5=4,IF($M$9=\"\",$O$7,\"\"),IF(AND($T$5=3,$W$5=$R$5),Initial!$L$19,\"\"))))","v":{"v":7.5,"d":"7.50"}},{"$f":"IF($T$5=1,$S$37,IF($T$5=2,$S$36,IF($T$5=4,IF($M$9=\"\",$O$8,\"\"),IF(AND($T$5=3,$W$5=$R$5),Initial!$L$20,\"\"))))","v":{"v":8.7,"d":"8.70"}},false,{"v":-0.3981778275591398,"d":"-0.40"},{"$error":"#N/A"},"",""]
[16,{"$nulls":5},"","",{"$nulls":9},{"$f":"IF($T$5=1,$S$39,IF($T$5=2,$S$38,IF($T$5=4,IF($M$9=\"\",$O$7,\"\"),IF(AND($T$5=3,$W$5=$R$5),Initial!$L$19,\"\"))))","v":{"v":7.5,"d":"7.50"}},{"$f":"IF($T$5=1,$S$37,IF($T$5=2,$S$36,IF($T$5=4,IF($M$9=\"\",$O$8,\"\"),IF(AND($T$5=3,$W$5=$R$5),Initial!$L$20,\"\"))))","v":{"v":8.7,"d":"8.70"}},false,{"v":-0.3981778275591398,"d":"-0.40"},{"$error":"#N/A"},"",""]
[17,{"$nulls":5},"","",{"$nulls":9},{"$f":"IF($T$5=1,$S$39,IF($T$5=2,$S$38,IF($T$5=4,IF($M$9=\"\",$O$7,\"\"),IF(AND($T$5=3,$W$5=$R$5),Initial!$L$19,\"\"))))","v":{"v":7.5,"d":"7.50"}},{"$f":"IF($T$5=1,$S$37,IF($T$5=2,$S$36,IF($T$5=4,IF($M$9=\"\",$O$8,\"\"),IF(AND($T$5=3,$W$5=$R$5),Initial!$L$20,\"\"))))","v":{"v":8.7,"d":"8.70"}},false,{"v":-0.3981778275591398,"d":"-0.40"},{"$error":"#N/A"},"",""]
[18,{"$nulls":5},"","",{"$nulls":9},{"$f":"IF($T$5=1,$S$39,IF($T$5=2,$S$38,IF($T$5=4,IF($M$9=\"\",$O$7,\"\"),IF(AND($T$5=3,$W$5=$R$5),Initial!$L$19,\"\"))))","v":{"v":7.5,"d":"7.50"}},{"$f":"IF($T$5=1,$S$37,IF($T$5=2,$S$36,IF($T$5=4,IF($M$9=\"\",$O$8,\"\"),IF(AND($T$5=3,$W$5=$R$5),Initial!$L$20,\"\"))))","v":{"v":8.7,"d":"8.70"}},false,{"v":-0.3981778275591398,"d":"-0.40"},{"$error":"#N/A"},"",""]
[19,{"$nulls":5},"","",{"$nulls":9},{"$f":"IF($T$5=1,$S$39,IF($T$5=2,$S$38,IF($T$5=4,IF($M$9=\"\",$O$7,\"\"),IF(AND($T$5=3,$W$5=$R$5),Initial!$L$19,\"\"))))","v":{"v":7.5,"d":"7.50"}},{"$f":"IF($T$5=1,$S$37,IF($T$5=2,$S$36,IF($T$5=4,IF($M$9=\"\",$O$8,\"\"),IF(AND($T$5=3,$W$5=$R$5),Initial!$L$20,\"\"))))","v":{"v":8.7,"d":"8.70"}},false,{"v":-0.3981778275591398,"d":"-0.40"},{"$error":"#N/A"},"",""]
[20,{"$nulls":5},"","",{"$nulls":9},{"$f":"IF($T$5=1,$S$39,IF($T$5=2,$S$38,IF($T$5=4,IF($M$9=\"\",$O$7,\"\"),IF(AND($T$5=3,$W$5=$R$5),Initial!$L$19,\"\"))))","v":{"v":7.5,"d":"7.50"}},{"$f":"IF($T$5=1,$S$37,IF($T$5=2,$S$36,IF($T$5=4,IF($M$9=\"\",$O$8,\"\"),IF(AND($T$5=3,$W$5=$R$5),Initial!$L$20,\"\"))))","v":{"v":8.7,"d":"8.70"}},false,{"v":-0.3981778275591398,"d":"-0.40"},{"$error":"#N/A"},"",""]
[21,{"$nulls":5},"","",{"$nulls":9},{"$f":"IF($T$5=1,$S$39,IF($T$5=2,$S$38,IF($T$5=4,IF($M$9=\"\",$O$7,\"\"),IF(AND($T$5=3,$W$5=$R$5),Initial!$L$19,\"\"))))","v":{"v":7.5,"d":"7.50"}},{"$f":"IF($T$5=1,$S$37,IF($T$5=2,$S$36,IF($T$5=4,IF($M$9=\"\",$O$8,\"\"),IF(AND($T$5=3,$W$5=$R$5),Initial!$L$20,\"\"))))","v":{"v":8.7,"d":"8.70"}},false,{"v":-0.3981778275591398,"d":"-0.40"},{"$error":"#N/A"},"",""]
[22,{"$nulls":5},"","",{"$nulls":9},{"$f":"IF($T$5=1,$S$39,IF($T$5=2,$S$38,IF($T$5=4,IF($M$9=\"\",$O$7,\"\"),IF(AND($T$5=3,$W$5=$R$5),Initial!$L$19,\"\"))))","v":{"v":7.5,"d":"7.50"}},{"$f":"IF($T$5=1,$S$37,IF($T$5=2,$S$36,IF($T$5=4,IF($M$9=\"\",$O$8,\"\"),IF(AND($T$5=3,$W$5=$R$5),Initial!$L$20,\"\"))))","v":{"v":8.7,"d":"8.70"}},false,{"v":-0.3981778275591398,"d":"-0.40"},{"$error":"#N/A"},"",""]
[23,{"$nulls":5},"","",{"$nulls":9},{"$f":"IF($T$5=1,$S$39,IF($T$5=2,$S$38,IF($T$5=4,IF($M$9=\"\",$O$7,\"\"),IF(AND($T$5=3,$W$5=$R$5),Initial!$L$19,\"\"))))","v":{"v":7.5,"d":"7.50"}},{"$f":"IF($T$5=1,$S$37,IF($T$5=2,$S$36,IF($T$5=4,IF($M$9=\"\",$O$8,\"\"),IF(AND($T$5=3,$W$5=$R$5),Initial!$L$20,\"\"))))","v":{"v":8.7,"d":"8.70"}},false,{"v":-0.3981778275591398,"d":"-0.40"},{"$error":"#N/A"},"",""]
[24,{"$nulls":5},"","",{"$nulls":9},{"$f":"IF($T$5=1,$S$39,IF($T$5=2,$S$38,IF($T$5=4,IF($M$9=\"\",$O$7,\"\"),IF(AND($T$5=3,$W$5=$R$5),Initial!$L$19,\"\"))))","v":{"v":7.5,"d":"7.50"}},{"$f":"IF($T$5=1,$S$37,IF($T$5=2,$S$36,IF($T$5=4,IF($M$9=\"\",$O$8,\"\"),IF(AND($T$5=3,$W$5=$R$5),Initial!$L$20,\"\"))))","v":{"v":8.7,"d":"8.70"}},false,{"v":-0.3981778275591398,"d":"-0.40"},{"$error":"#N/A"},"",""]
[]
[null,{"$f":"Def!$B$67","v":"Data reviewed by (signature and date)"},{"$nulls":4},{"$f":"Def!$B$71","v":"Reviewer's Comments"}]

{"sheet":"Report 160°C","index":4,"n_rows":72,"n_cols":24,"rows_kept":72,"merged":[[0,1,1,2],[0,3,1,9],[2,3,2,9],[2,19,3,19],[2,20,3,20],[2,21,3,22],[3,8,3,14],[5,1,5,4],[5,7,5,8],[5,10,5,13],[5,14,5,15],[6,11,6,13],[7,11,7,13],[8,12,9,14],[10,7,10,9],[10,12,15,14],[11,7,12,9],[19,13,20,14],[21,13,24,14],[25,13,26,14],[36,1,38,5],[36,7,38,11],[40,1,41,2],[40,3,41,9],[40,10,41,14],[43,1,45,1],[43,2,45,2],[43,3,43,4],[43,5,43,7],[43,8,43,12],[43,13,45,14],[44,3,45,3],[44,4,45,4],[44,5,45,5],[44,6,45,6],[44,7,45,7],[44,8,45,12],[44,19,45,19],[44,20,45,20],[44,21,45,21],[44,22,44,23],[46,8,46,12],[46,13,46,14],[47,8,47,12],[47,13,47,14],[48,8,48,12],[48,13,48,14],[49,8,49,12],[49,13,49,14],[50,8,50,12],[50,13,50,14],[51,8,51,12],[51,13,51,14],[52,8,52,12],[52,13,52,14],[53,8,53,12],[53,13,53,14],[54,8,54,12],[54,13,54,14],[55,8,55,12],[55,13,55,14],[56,8,56,12],[56,13,56,14],[57,8,57,12],[57,13,57,14],[58,8,58,12],[58,13,58,14],[59,8,59,12],[59,13,59,14],[60,8,60,12],[60,13,60,14],[61,8,61,12],[61,13,61,14],[62,8,62,12],[62,13,62,14],[63,8,63,12],[63,13,63,14],[64,8,64,12],[64,13,64,14],[65,8,65,12],[65,13,65,14],[66,8,66,12],[66,13,66,14],[67,8,67,12],[67,13,67,14],[68,8,68,12],[68,13,68,14],[69,8,69,12],[69,13,69,14],[71,1,71,4],[71,6,71,10],[72,1,74,4],[72,6,74,11]]}
[null,"SmartCalTM",null,{"$f":"Def!$B$6","v":"Performance test for Moisture Analyzer"}]
[{"$nulls":17},"Are D7 to D11 complete?"]
[null,{"$f":"Def!$B$68","v":"Version 2.10   2012-03"},null,{"$f":"$R$33","v":"Test temperature 160°C"},{"$nulls":13},{"$f":"(OR(AND(OR($T$5=1,$T$5=2,$T$5=3),$S$3+COUNTA($O$7:$O$8)=5),AND($T$5=4,COUNT($O$7:$O$8)=2,$S$3=5)))","v":false},{"$f":"COUNTA(Initial!D5:E9)","v":0},"Control limits Source","Selected Language","Define Limits Temperature"]
[{"$nulls":17},"Temperature number"]
[{"$nulls":14},{"$f":"IF($T$5=\"\",\"\",IF(AND(OR($T$5<4,$T$5>4),COUNTA($O$7:$O$8)>0),Def!$B$73,\"\"))","v":""},null,null,4,null,{"$f":"Initial!$P$11","v":1},{"$f":"Initial!$P$2","v":1},{"$f":"Initial!$P$5","v":"100°C"},{"$f":"Initial!$P$4","v":2}]
[null,{"$f":"Def!$B$10","v":"Instrument identification"},{"$nulls":5},{"$f":"Def!$B$16","v":"Testing parameter"},null,null,{"$f":"IF(OR($T$5=1,$T$5=2),Def!$B$24,\"\")","v":"MT Control Limits [%MC]"},{"$nulls":3},{"$f":"IF($T$5=1,Def!$B$63,IF($T$5=2,Def!$B$20,IF($T$5=4,Def!$B$64,\"\")))","v":"Certified"},null,null,{"$f":"Def!$B$39","v":"Yes"}]
[null,null,{"$f":"Def!$B$11:$B$15","v":"Company"},{"$f":"IF(Initial!$D$5:$D$9=\"\",\"\",Initial!$D$5:$D$9)","v":""},{"$nulls":4},{"$f":"Def!$B$17","v":"Switch-off criterion"},{"$f":"Initial!$J$6:$J$8","v":"Time (10 min)"},null,{"$f":"IF($O$5>\"\",\"\",Def!$B$25&\"   \"&IF($T$5=1,TEXT($S$39,\"0.0\"),IF($T$5=2,TEXT($S$38,\"0.0\"),IF($T$5=3,IF($W$5=$R$5,TEXT(Initial!$L$19,\"0.0\"),\"\"),\"\"))))","v":"Lower Limit   10.0"},{"$nulls":5},{"$f":"Def!$B$40","v":"No"},null,{"$f":"COUNTA(D7:D11)","v":5}]
[null,null,"Instrument type","",{"$nulls":4},{"$f":"Def!$B$19","v":"Drying program"},"Standard",null,{"$f":"IF($O$5>\"\",\"\",Def!$B$26&\"   \"&IF($T$5=1,TEXT($S$37,\"0.0\"),IF($T$5=2,TEXT($S$36,\"0.0\"),IF($T$5=3,IF($W$5=$R$5,TEXT(Initial!$L$20,\"0.0\"),\"\"),\"\"))))","v":"Upper Limit   11.6"}]
[null,null,"Instrument ID","",{"$nulls":4},{"$f":"Def!$B$21","v":"Display mode"},"%MC",null,null,{"$f":"IF($T$5=\"\",\"\",IF(AND($I$4=$R$12,$O$7>0,$O$8>0,$O$8<$O$7),Def!$B$74,\"\"))","v":""},{"$nulls":4},"************"]
[null,null,"Location",""]
[null,null,"Contact Person","",{"$nulls":3},"Perform test with cold instrument."]
[]
[]
[{"$nulls":17},{"$f":"\"Control Limits: \"&IF(OR($T$5=1,$T$5=2),Def!$B$23,IF($T$5=4,Def!$B$57,\"\"))","v":"Control Limits: MT Control Limits"}]
[]
[]
[{"$nulls":17},"************"]
[]
[]
[{"$nulls":13},{"$f":"Def!$B$29","v":"Test Results %MCN"}]
[]
[{"$nulls":13},{"$f":"IF(AND($T$5=3,OR($O$7=\"\",$O$8=\"\")),\"\",$R$14)","v":"Control Limits: MT Control Limits"}]
[]
[]
[]
[{"$nulls":13},{"$f":"IF(OR($T$5=3,$T$5=4),$W$45,\"\")","v":""}]
[]
[]
[]
[]
[]
[{"$nulls":17},"************"]
[{"$nulls":17},{"$f":"Def!$B$9&\" \"&\"160°C\"","v":"Test temperature 160°C"}]
[]
[{"$nulls":17},"MT Calibration limits"]
[null,{"$f":"Def!$B$67","v":"Data reviewed by (signature and date)"},{"$nulls":5},{"$f":"Def!$B$71","v":"Reviewer's Comments"},{"$nulls":9},"Upper standard",{"$f":"TRANSPOSE(Def!$C$108:$F$108)","v":11.7}]
[{"$nulls":17},"Upper certified",11.6]
[{"$nulls":17},"Lower standard",9.9]
[{"$nulls":17},"Lower certified",10]
[]
[null,"SmartCalTM",null,{"$f":"Def!$B$6","v":"Performance test for Moisture Analyzer"},{"$nulls":6},{"$f":"$R$33","v":"Test temperature 160°C"}]
[{"$nulls":17},{"$f":"TODAY()","v":"2012-10-23"}]
[null,{"$f":"Def!$B$68","v":"Version 2.10   2012-03"}]
[null,{"$f":"Def!$B$31","v":"Date"},{"$f":"Def!$B$70","v":"SmartCal Lot No."},{"$f":"Def!$B$33","v":"Environmental conditions"},null,{"$f":"Def!$B$28","v":"Test Results"},null,null,{"$f":"Def!$B$42","v":"Remarks"},{"$nulls":4},{"$f":"Def!$B$44","v":"Name"}]
[{"$nulls":3},{"$f":"Def!$B$34","v":"%RH"},{"$f":"Def!$B$35","v":"°C"},{"$f":"Def!$B$36","v":"%MC"},{"$f":"Def!$B$37","v":"%MCN"},{"$f":"Def!$B$38","v":"Within Limits"},{"$f":"Def!$B$43","v":"e.g. Package damaged, adjustment done etc."},{"$nulls":10},"ENTRIES COMPLETE?","REPORTED ANSWERS","PLOTTED ANSWERS",{"$f":"Def!$B$54","v":"MT Control Limits (certified)"}]
[{"$nulls":17},"LOWER LIMIT","UPPER LIMIT",{"$nulls":3},"LOWER LIMIT","UPPER LIMIT"]
[1,{"$nulls":5},{"$f":"Result_160_2","v":""},{"$f":"WithinLimits_160","v":""},{"$nulls":9},{"$f":"IF($T$5=1,$S$39,IF($T$5=2,$S$38,IF($T$5=4,IF($M$9=\"\",$O$7,\"\"),IF(AND($T$5=3,$W$5=$R$5),Initial!$L$19,\"\"))))","v":{"v":10,"d":"10.00"}},{"$f":"IF($T$5=1,$S$37,IF($T$5=2,$S$36,IF($T$5=4,IF($M$9=\"\",$O$8,\"\"),IF(AND($T$5=3,$W$5=$R$5),Initial!$L$20,\"\"))))","v":{"v":11.6,"d":"11.60"}},{"$f":"AND($R$3,COUNTA($B47:$E47,$N47)=5)","v":false},{"$f":"CorrMC1_160","v":{"v":-0.3981778275591398,"d":"-0.40"}},{"$f":"Result_160_1","v":{"$error":"#N/A"}},{"$f":"IF($T$5=1,\"\",IF($T$5=2,\"\",IF($T$5=3,$S$39,IF($T$5=4,$S$39,\"\"))))","v":""},{"$f":"IF($T$5=1,\"\",IF($T$5=2,\"\",IF($T$5=3,$S$37,IF($T$5=4,$S$37,\"\"))))","v":""}]
[2,{"$nulls":5},"","",{"$nulls":9},{"$f":"IF($T$5=1,$S$39,IF($T$5=2,$S$38,IF($T$5=4,IF($M$9=\"\",$O$7,\"\"),IF(AND($T$5=3,$W$5=$R$5),Initial!$L$19,\"\"))))","v":{"v":10,"d":"10.00"}},{"$f":"IF($T$5=1,$S$37,IF($T$5=2,$S$36,IF($T$5=4,IF($M$9=\"\",$O$8,\"\"),IF(AND($T$5=3,$W$5=$R$5),Initial!$L$20,\"\"))))","v":{"v":11.6,"d":"11.60"}},{"$f":"AND($R$3,COUNTA($B48:$E48,$N48)=5)","v":false},{"v":-0.3981778275591398,"d":"-0.40"},{"$error":"#N/A"},{"$f":"IF($T$5=1,\"\",IF($T$5=2,\"\",IF($T$5=3,$S$39,IF($T$5=4,$S$39,\"\"))))","v":""},{"$f":"IF($T$5=1,\"\",IF($T$5=2,\"\",IF($T$5=3,$S$37,IF($T$5=4,$S$37,\"\"))))","v":""}]
[3,{"$nulls":5},"","",{"$nulls":9},{"$f":"IF($T$5=1,$S$39,IF($T$5=2,$S$38,IF($T$5=4,IF($M$9=\"\",$O$7,\"\"),IF(AND($T$5=3,$W$5=$R$5),Initial!$L$19,\"\"))))","v":{"v":10,"d":"10.00"}},{"$f":"IF($T$5=1,$S$37,IF($T$5=2,$S$36,IF($T$5=4,IF($M$9=\"\",$O$8,\"\"),IF(AND($T$5=3,$W$5=$R$5),Initial!$L$20,\"\"))))","v":{"v":11.6,"d":"11.60"}},false,{"v":-0.3981778275591398,"d":"-0.40"},{"$error":"#N/A"},"",""]
[4,{"$nulls":5},"","",{"$nulls":9},{"$f":"IF($T$5=1,$S$39,IF($T$5=2,$S$38,IF($T$5=4,IF($M$9=\"\",$O$7,\"\"),IF(AND($T$5=3,$W$5=$R$5),Initial!$L$19,\"\"))))","v":{"v":10,"d":"10.00"}},{"$f":"IF($T$5=1,$S$37,IF($T$5=2,$S$36,IF($T$5=4,IF($M$9=\"\",$O$8,\"\"),IF(AND($T$5=3,$W$5=$R$5),Initial!$L$20,\"\"))))","v":{"v":11.6,"d":"11.60"}},false,{"v":-0.3981778275591398,"d":"-0.40"},{"$error":"#N/A"},"",""]
[5,{"$nulls":5},"","",{"$nulls":9},{"$f":"IF($T$5=1,$S$39,IF($T$5=2,$S$38,IF($T$5=4,IF($M$9=\"\",$O$7,\"\"),IF(AND($T$5=3,$W$5=$R$5),Initial!$L$19,\"\"))))","v":{"v":10,"d":"10.00"}},{"$f":"IF($T$5=1,$S$37,IF($T$5=2,$S$36,IF($T$5=4,IF($M$9=\"\",$O$8,\"\"),IF(AND($T$5=3,$W$5=$R$5),Initial!$L$20,\"\"))))","v":{"v":11.6,"d":"11.60"}},false,{"v":-0.3981778275591398,"d":"-0.40"},{"$error":"#N/A"},"",""]
[6,{"$nulls":5},"","",{"$nulls":9},{"$f":"IF($T$5=1,$S$39,IF($T$5=2,$S$38,IF($T$5=4,IF($M$9=\"\",$O$7,\"\"),IF(AND($T$5=3,$W$5=$R$5),Initial!$L$19,\"\"))))","v":{"v":10,"d":"10.00"}},{"$f":"IF($T$5=1,$S$37,IF($T$5=2,$S$36,IF($T$5=4,IF($M$9=\"\",$O$8,\"\"),IF(AND($T$5=3,$W$5=$R$5),Initial!$L$20,\"\"))))","v":{"v":11.6,"d":"11.60"}},false,{"v":-0.3981778275591398,"d":"-0.40"},{"$error":"#N/A"},"",""]
[7,{"$nulls":5},"","",{"$nulls":9},{"$f":"IF($T$5=1,$S$39,IF($T$5=2,$S$38,IF($T$5=4,IF($M$9=\"\",$O$7,\"\"),IF(AND($T$5=3,$W$5=$R$5),Initial!$L$19,\"\"))))","v":{"v":10,"d":"10.00"}},{"$f":"IF($T$5=1,$S$37,IF($T$5=2,$S$36,IF($T$5=4,IF($M$9=\"\",$O$8,\"\"),IF(AND($T$5=3,$W$5=$R$5),Initial!$L$20,\"\"))))","v":{"v":11.6,"d":"11.60"}},false,{"v":-0.3981778275591398,"d":"-0.40"},{"$error":"#N/A"},"",""]
[8,{"$nulls":5},"","",{"$nulls":9},{"$f":"IF($T$5=1,$S$39,IF($T$5=2,$S$38,IF($T$5=4,IF($M$9=\"\",$O$7,\"\"),IF(AND($T$5=3,$W$5=$R$5),Initial!$L$19,\"\"))))","v":{"v":10,"d":"10.00"}},{"$f":"IF($T$5=1,$S$37,IF($T$5=2,$S$36,IF($T$5=4,IF($M$9=\"\",$O$8,\"\"),IF(AND($T$5=3,$W$5=$R$5),Initial!$L$20,\"\"))))","v":{"v":11.6,"d":"11.60"}},false,{"v":-0.3981778275591398,"d":"-0.40"},{"$error":"#N/A"},"",""]
[9,{"$nulls":5},"","",{"$nulls":9},{"$f":"IF($T$5=1,$S$39,IF($T$5=2,$S$38,IF($T$5=4,IF($M$9=\"\",$O$7,\"\"),IF(AND($T$5=3,$W$5=$R$5),Initial!$L$19,\"\"))))","v":{"v":10,"d":"10.00"}},{"$f":"IF($T$5=1,$S$37,IF($T$5=2,$S$36,IF($T$5=4,IF($M$9=\"\",$O$8,\"\"),IF(AND($T$5=3,$W$5=$R$5),Initial!$L$20,\"\"))))","v":{"v":11.6,"d":"11.60"}},false,{"v":-0.3981778275591398,"d":"-0.40"},{"$error":"#N/A"},"",""]
[10,{"$nulls":5},"","",{"$nulls":9},{"$f":"IF($T$5=1,$S$39,IF($T$5=2,$S$38,IF($T$5=4,IF($M$9=\"\",$O$7,\"\"),IF(AND($T$5=3,$W$5=$R$5),Initial!$L$19,\"\"))))","v":{"v":10,"d":"10.00"}},{"$f":"IF($T$5=1,$S$37,IF($T$5=2,$S$36,IF($T$5=4,IF($M$9=\"\",$O$8,\"\"),IF(AND($T$5=3,$W$5=$R$5),Initial!$L$20,\"\"))))","v":{"v":11.6,"d":"11.60"}},false,{"v":-0.3981778275591398,"d":"-0.40"},{"$error":"#N/A"},"",""]
[11,{"$nulls":5},"","",{"$nulls":9},{"$f":"IF($T$5=1,$S$39,IF($T$5=2,$S$38,IF($T$5=4,IF($M$9=\"\",$O$7,\"\"),IF(AND($T$5=3,$W$5=$R$5),Initial!$L$19,\"\"))))","v":{"v":10,"d":"10.00"}},{"$f":"IF($T$5=1,$S$37,IF($T$5=2,$S$36,IF($T$5=4,IF($M$9=\"\",$O$8,\"\"),IF(AND($T$5=3,$W$5=$R$5),Initial!$L$20,\"\"))))","v":{"v":11.6,"d":"11.60"}},false,{"v":-0.3981778275591398,"d":"-0.40"},{"$error":"#N/A"},"",""]
[12,{"$nulls":5},"","",{"$nulls":9},{"$f":"IF($T$5=1,$S$39,IF($T$5=2,$S$38,IF($T$5=4,IF($M$9=\"\",$O$7,\"\"),IF(AND($T$5=3,$W$5=$R$5),Initial!$L$19,\"\"))))","v":{"v":10,"d":"10.00"}},{"$f":"IF($T$5=1,$S$37,IF($T$5=2,$S$36,IF($T$5=4,IF($M$9=\"\",$O$8,\"\"),IF(AND($T$5=3,$W$5=$R$5),Initial!$L$20,\"\"))))","v":{"v":11.6,"d":"11.60"}},false,{"v":-0.3981778275591398,"d":"-0.40"},{"$error":"#N/A"},"",""]
[13,{"$nulls":5},"","",{"$nulls":9},{"$f":"IF($T$5=1,$S$39,IF($T$5=2,$S$38,IF($T$5=4,IF($M$9=\"\",$O$7,\"\"),IF(AND($T$5=3,$W$5=$R$5),Initial!$L$19,\"\"))))","v":{"v":10,"d":"10.00"}},{"$f":"IF($T$5=1,$S$37,IF($T$5=2,$S$36,IF($T$5=4,IF($M$9=\"\",$O$8,\"\"),IF(AND($T$5=3,$W$5=$R$5),Initial!$L$20,\"\"))))","v":{"v":11.6,"d":"11.60"}},false,{"v":-0.3981778275591398,"d":"-0.40"},{"$error":"#N/A"},"",""]
[14,{"$nulls":5},"","",{"$nulls":9},{"$f":"IF($T$5=1,$S$39,IF($T$5=2,$S$38,IF($T$5=4,IF($M$9=\"\",$O$7,\"\"),IF(AND($T$5=3,$W$5=$R$5),Initial!$L$19,\"\"))))","v":{"v":10,"d":"10.00"}},{"$f":"IF($T$5=1,$S$37,IF($T$5=2,$S$36,IF($T$5=4,IF($M$9=\"\",$O$8,\"\"),IF(AND($T$5=3,$W$5=$R$5),Initial!$L$20,\"\"))))","v":{"v":11.6,"d":"11.60"}},false,{"v":-0.3981778275591398,"d":"-0.40"},{"$error":"#N/A"},"",""]
[15,{"$nulls":5},"","",{"$nulls":9},{"$f":"IF($T$5=1,$S$39,IF($T$5=2,$S$38,IF($T$5=4,IF($M$9=\"\",$O$7,\"\"),IF(AND($T$5=3,$W$5=$R$5),Initial!$L$19,\"\"))))","v":{"v":10,"d":"10.00"}},{"$f":"IF($T$5=1,$S$37,IF($T$5=2,$S$36,IF($T$5=4,IF($M$9=\"\",$O$8,\"\"),IF(AND($T$5=3,$W$5=$R$5),Initial!$L$20,\"\"))))","v":{"v":11.6,"d":"11.60"}},false,{"v":-0.3981778275591398,"d":"-0.40"},{"$error":"#N/A"},"",""]
[16,{"$nulls":5},"","",{"$nulls":9},{"$f":"IF($T$5=1,$S$39,IF($T$5=2,$S$38,IF($T$5=4,IF($M$9=\"\",$O$7,\"\"),IF(AND($T$5=3,$W$5=$R$5),Initial!$L$19,\"\"))))","v":{"v":10,"d":"10.00"}},{"$f":"IF($T$5=1,$S$37,IF($T$5=2,$S$36,IF($T$5=4,IF($M$9=\"\",$O$8,\"\"),IF(AND($T$5=3,$W$5=$R$5),Initial!$L$20,\"\"))))","v":{"v":11.6,"d":"11.60"}},false,{"v":-0.3981778275591398,"d":"-0.40"},{"$error":"#N/A"},"",""]
[17,{"$nulls":5},"","",{"$nulls":9},{"$f":"IF($T$5=1,$S$39,IF($T$5=2,$S$38,IF($T$5=4,IF($M$9=\"\",$O$7,\"\"),IF(AND($T$5=3,$W$5=$R$5),Initial!$L$19,\"\"))))","v":{"v":10,"d":"10.00"}},{"$f":"IF($T$5=1,$S$37,IF($T$5=2,$S$36,IF($T$5=4,IF($M$9=\"\",$O$8,\"\"),IF(AND($T$5=3,$W$5=$R$5),Initial!$L$20,\"\"))))","v":{"v":11.6,"d":"11.60"}},false,{"v":-0.3981778275591398,"d":"-0.40"},{"$error":"#N/A"},"",""]
[18,{"$nulls":5},"","",{"$nulls":9},{"$f":"IF($T$5=1,$S$39,IF($T$5=2,$S$38,IF($T$5=4,IF($M$9=\"\",$O$7,\"\"),IF(AND($T$5=3,$W$5=$R$5),Initial!$L$19,\"\"))))","v":{"v":10,"d":"10.00"}},{"$f":"IF($T$5=1,$S$37,IF($T$5=2,$S$36,IF($T$5=4,IF($M$9=\"\",$O$8,\"\"),IF(AND($T$5=3,$W$5=$R$5),Initial!$L$20,\"\"))))","v":{"v":11.6,"d":"11.60"}},false,{"v":-0.3981778275591398,"d":"-0.40"},{"$error":"#N/A"},"",""]
[19,{"$nulls":5},"","",{"$nulls":9},{"$f":"IF($T$5=1,$S$39,IF($T$5=2,$S$38,IF($T$5=4,IF($M$9=\"\",$O$7,\"\"),IF(AND($T$5=3,$W$5=$R$5),Initial!$L$19,\"\"))))","v":{"v":10,"d":"10.00"}},{"$f":"IF($T$5=1,$S$37,IF($T$5=2,$S$36,IF($T$5=4,IF($M$9=\"\",$O$8,\"\"),IF(AND($T$5=3,$W$5=$R$5),Initial!$L$20,\"\"))))","v":{"v":11.6,"d":"11.60"}},false,{"v":-0.3981778275591398,"d":"-0.40"},{"$error":"#N/A"},"",""]
[20,{"$nulls":5},"","",{"$nulls":9},{"$f":"IF($T$5=1,$S$39,IF($T$5=2,$S$38,IF($T$5=4,IF($M$9=\"\",$O$7,\"\"),IF(AND($T$5=3,$W$5=$R$5),Initial!$L$19,\"\"))))","v":{"v":10,"d":"10.00"}},{"$f":"IF($T$5=1,$S$37,IF($T$5=2,$S$36,IF($T$5=4,IF($M$9=\"\",$O$8,\"\"),IF(AND($T$5=3,$W$5=$R$5),Initial!$L$20,\"\"))))","v":{"v":11.6,"d":"11.60"}},false,{"v":-0.3981778275591398,"d":"-0.40"},{"$error":"#N/A"},"",""]
[21,{"$nulls":5},"","",{"$nulls":9},{"$f":"IF($T$5=1,$S$39,IF($T$5=2,$S$38,IF($T$5=4,IF($M$9=\"\",$O$7,\"\"),IF(AND($T$5=3,$W$5=$R$5),Initial!$L$19,\"\"))))","v":{"v":10,"d":"10.00"}},{"$f":"IF($T$5=1,$S$37,IF($T$5=2,$S$36,IF($T$5=4,IF($M$9=\"\",$O$8,\"\"),IF(AND($T$5=3,$W$5=$R$5),Initial!$L$20,\"\"))))","v":{"v":11.6,"d":"11.60"}},false,{"v":-0.3981778275591398,"d":"-0.40"},{"$error":"#N/A"},"",""]
[22,{"$nulls":5},"","",{"$nulls":9},{"$f":"IF($T$5=1,$S$39,IF($T$5=2,$S$38,IF($T$5=4,IF($M$9=\"\",$O$7,\"\"),IF(AND($T$5=3,$W$5=$R$5),Initial!$L$19,\"\"))))","v":{"v":10,"d":"10.00"}},{"$f":"IF($T$5=1,$S$37,IF($T$5=2,$S$36,IF($T$5=4,IF($M$9=\"\",$O$8,\"\"),IF(AND($T$5=3,$W$5=$R$5),Initial!$L$20,\"\"))))","v":{"v":11.6,"d":"11.60"}},false,{"v":-0.3981778275591398,"d":"-0.40"},{"$error":"#N/A"},"",""]
[23,{"$nulls":5},"","",{"$nulls":9},{"$f":"IF($T$5=1,$S$39,IF($T$5=2,$S$38,IF($T$5=4,IF($M$9=\"\",$O$7,\"\"),IF(AND($T$5=3,$W$5=$R$5),Initial!$L$19,\"\"))))","v":{"v":10,"d":"10.00"}},{"$f":"IF($T$5=1,$S$37,IF($T$5=2,$S$36,IF($T$5=4,IF($M$9=\"\",$O$8,\"\"),IF(AND($T$5=3,$W$5=$R$5),Initial!$L$20,\"\"))))","v":{"v":11.6,"d":"11.60"}},false,{"v":-0.3981778275591398,"d":"-0.40"},{"$error":"#N/A"},"",""]
[24,{"$nulls":5},"","",{"$nulls":9},{"$f":"IF($T$5=1,$S$39,IF($T$5=2,$S$38,IF($T$5=4,IF($M$9=\"\",$O$7,\"\"),IF(AND($T$5=3,$W$5=$R$5),Initial!$L$19,\"\"))))","v":{"v":10,"d":"10.00"}},{"$f":"IF($T$5=1,$S$37,IF($T$5=2,$S$36,IF($T$5=4,IF($M$9=\"\",$O$8,\"\"),IF(AND($T$5=3,$W$5=$R$5),Initial!$L$20,\"\"))))","v":{"v":11.6,"d":"11.60"}},false,{"v":-0.3981778275591398,"d":"-0.40"},{"$error":"#N/A"},"",""]
[]
[null,{"$f":"Def!$B$67","v":"Data reviewed by (signature and date)"},{"$nulls":4},{"$f":"Def!$B$71","v":"Reviewer's Comments"}]

{"sheet":"Report Other","index":5,"n_rows":72,"n_cols":23,"rows_kept":72,"merged":[[0,1,1,2],[0,3,1,9],[2,3,2,9],[2,19,3,19],[2,20,3,20],[2,21,3,22],[3,8,3,14],[5,1,5,4],[5,7,5,8],[5,10,5,13],[5,14,5,15],[6,11,6,13],[7,11,7,13],[8,12,9,14],[10,7,10,9],[10,12,15,14],[11,7,12,9],[19,13,20,14],[21,13,24,14],[25,13,26,14],[36,1,38,5],[36,7,38,11],[40,1,41,2],[40,3,41,9],[40,10,41,14],[43,1,45,1],[43,2,45,2],[43,3,43,4],[43,5,43,7],[43,8,43,12],[43,13,45,14],[44,3,45,3],[44,4,45,4],[44,5,45,5],[44,6,45,6],[44,7,45,7],[44,8,45,12],[44,19,45,19],[44,20,45,20],[44,21,45,21],[44,22,44,23],[46,8,46,12],[46,13,46,14],[47,8,47,12],[47,13,47,14],[48,8,48,12],[48,13,48,14],[49,8,49,12],[49,13,49,14],[50,8,50,12],[50,13,50,14],[51,8,51,12],[51,13,51,14],[52,8,52,12],[52,13,52,14],[53,8,53,12],[53,13,53,14],[54,8,54,12],[54,13,54,14],[55,8,55,12],[55,13,55,14],[56,8,56,12],[56,13,56,14],[57,8,57,12],[57,13,57,14],[58,8,58,12],[58,13,58,14],[59,8,59,12],[59,13,59,14],[60,8,60,12],[60,13,60,14],[61,8,61,12],[61,13,61,14],[62,8,62,12],[62,13,62,14],[63,8,63,12],[63,13,63,14],[64,8,64,12],[64,13,64,14],[65,8,65,12],[65,13,65,14],[66,8,66,12],[66,13,66,14],[67,8,67,12],[67,13,67,14],[68,8,68,12],[68,13,68,14],[69,8,69,12],[69,13,69,14],[71,1,71,4],[71,6,71,10],[72,1,74,4],[72,6,74,11]]}
[null,"SmartCalTM",null,{"$f":"Def!$B$6","v":"Performance test for Moisture Analyzer"}]
[{"$nulls":17},"Are D7 to D11 complete?"]
[null,{"$f":"Def!$B$68","v":"Version 2.10   2012-03"},null,{"$f":"$R$33","v":""},{"$nulls":13},{"$f":"OR(AND(OR($T$5=1,$T$5=2,$T$5=3),$S$3+COUNTA($O$7:$O$8)=5),AND($T$5=4,COUNT($O$7:$O$8)=2,$S$3=5))","v":false},{"$f":"COUNTA(Initial!D5:E9)","v":0},"Control limits Source","Selected Language","Define Limits Temperature"]
[{"$nulls":17},"Temperature number"]
[{"$nulls":14},{"$f":"IF($T$5=\"\",\"\",IF(AND(OR($T$5<4,$T$5>4),COUNTA($O$7:$O$8)>0),Def!$B$73,\"\"))","v":""},null,null,5,null,{"$f":"Initial!$P$11","v":1},{"$f":"Initial!$P$2","v":1},{"$f":"Initial!$P$5","v":"100°C"},{"$f":"Initial!$P$4","v":2}]
[null,{"$f":"Def!$B$10","v":"Instrument identification"},{"$nulls":5},{"$f":"Def!$B$16","v":"Testing parameter"},{"$nulls":6},{"$f":"IF(OR($T$5=1,$T$5=2),\"\",IF($T$5=4,Def!$B$64,\"\"))","v":""},null,null,{"$f":"Def!$B$39","v":"Yes"}]
[null,null,{"$f":"Def!$B$11:$B$15","v":"Company"},{"$f":"IF(Initial!$D$5:$D$9=\"\",\"\",Initial!$D$5:$D$9)","v":""},{"$nulls":4},{"$f":"Def!$B$17","v":"Switch-off criterion"},{"$f":"Initial!$J$6:$J$8","v":"Time (10 min)"},null,{"$f":"IF($O$5>\"\",\"\",IF($T$5=4,Def!$B$25,IF($T$5=3,IF($W$5=$R$5,Def!$B$25&\"  \"&TEXT(Initial!$L$19,\"0.0\"),\"\"),\"\")))","v":""},{"$nulls":5},{"$f":"Def!$B$40","v":"No"}]
[null,null,"Instrument type","",{"$nulls":4},{"$f":"Def!$B$19","v":"Drying program"},"Standard",null,{"$f":"IF($O$5>\"\",\"\",IF($T$5=4,Def!$B$26,IF($T$5=3,IF($W$5=$R$5,Def!$B$26&\"  \"&TEXT(Initial!$L$20,\"0.0\"),\"\"),\"\")))","v":""}]
[null,null,"Instrument ID","",{"$nulls":4},{"$f":"Def!$B$21","v":"Display mode"},"%MC",null,null,{"$f":"IF($T$5=\"\",\"\",IF(AND($I$4=$R$12,$O$7>0,$O$8>0,$O$8<$O$7),Def!$B$74,\"\"))","v":""},{"$nulls":4},"************"]
[null,null,"Location",""]
[null,null,"Contact Person","",{"$nulls":3},"Perform test with cold instrument."]
[]
[]
[{"$nulls":17},{"$f":"\"Control Limits: \"&IF(OR($T$5=1,$T$5=2),Def!$B$23,IF($T$5=4,Def!$B$57,\"\"))","v":"Control Limits: MT Control Limits"}]
[]
[]
[{"$nulls":17},"************"]
[]
[]
[{"$nulls":13},{"$f":"Def!$B$29","v":"Test Results %MCN"}]
[]
[{"$nulls":13},{"$f":"IF(AND($T$5=3,OR($O$7=\"\",$O$8=\"\")),\"\",$R$14)","v":"Control Limits: MT Control Limits"}]
{"$rows_empty":9}
[{"$nulls":17},"************"]
[{"$nulls":17},{"$f":"IF(Initial!$L$5=\"\",\"\",Def!$B$9&\" \"&IF($R$5=5,Initial!$L$5&\"°C\",\"\"))","v":""}]
[]
[{"$nulls":17},"MT Calibration limits"]
[null,{"$f":"Def!$B$67","v":"Data reviewed by (signature and date)"},{"$nulls":5},{"$f":"Def!$B$71","v":"Reviewer's Comments"},{"$nulls":9},"Upper standard"]
[{"$nulls":17},"Upper certified"]
[{"$nulls":17},"Lower standard"]
[{"$nulls":17},"Lower certified"]
[]
[null,"SmartCalTM",null,{"$f":"Def!$B$6","v":"Performance test for Moisture Analyzer"},{"$nulls":6},{"$f":"$R$33","v":""}]
[{"$nulls":17},{"$f":"TODAY()","v":"2012-10-23"}]
[null,{"$f":"Def!$B$68","v":"Version 2.10   2012-03"}]
[null,{"$f":"Def!$B$31","v":"Date"},{"$f":"Def!$B$70","v":"SmartCal Lot No."},{"$f":"Def!$B$33","v":"Environmental conditions"},null,{"$f":"Def!$B$28","v":"Test Results"},null,null,{"$f":"Def!$B$42","v":"Remarks"},{"$nulls":4},{"$f":"Def!$B$44","v":"Name"}]
[{"$nulls":3},{"$f":"Def!$B$34","v":"%RH"},{"$f":"Def!$B$35","v":"°C"},{"$f":"Def!$B$36","v":"%MC"},{"$f":"Def!$B$37","v":"%MCN"},{"$f":"Def!$B$38","v":"Within Limits"},{"$f":"Def!$B$43","v":"e.g. Package damaged, adjustment done etc."},{"$nulls":10},"ENTRIES COMPLETE?","REPORTED ANSWERS","PLOTTED ANSWERS"]
[{"$nulls":17},"LOWER LIMIT","UPPER LIMIT"]
[1,{"$nulls":5},{"$f":"Result_000_2","v":""},{"$f":"WithinLimits_000","v":""},{"$nulls":9},{"$f":"IF($T$5=1,$S$39,IF($T$5=2,$S$38,IF($T$5=4,IF($M$9=\"\",$O$7,\"\"),IF(AND($T$5=3,$W$5=$R$5),Initial!$L$19,\"\"))))","v":{"v":0,"d":"0.00"}},{"$f":"IF($T$5=1,$S$37,IF($T$5=2,$S$36,IF($T$5=4,IF($M$9=\"\",$O$8,\"\"),IF(AND($T$5=3,$W$5=$R$5),Initial!$L$20,\"\"))))","v":{"v":0,"d":"0.00"}},{"$f":"AND($R$3,COUNTA($B47:$E47,$N47)=5)","v":false},{"$f":"CorrMC1_000","v":{"v":-0.3981778275591398,"d":"-0.40"}},{"$f":"Result_000_1","v":{"$error":"#N/A"}}]
[2,{"$nulls":5},"","",{"$nulls":9},{"$f":"IF($T$5=1,$S$39,IF($T$5=2,$S$38,IF($T$5=4,IF($M$9=\"\",$O$7,\"\"),IF(AND($T$5=3,$W$5=$R$5),Initial!$L$19,\"\"))))","v":{"v":0,"d":"0.00"}},{"$f":"IF($T$5=1,$S$37,IF($T$5=2,$S$36,IF($T$5=4,IF($M$9=\"\",$O$8,\"\"),IF(AND($T$5=3,$W$5=$R$5),Initial!$L$20,\"\"))))","v":{"v":0,"d":"0.00"}},{"$f":"AND($R$3,COUNTA($B48:$E48,$N48)=5)","v":false},{"v":-0.3981778275591398,"d":"-0.40"},{"$error":"#N/A"}]
[3,{"$nulls":5},"","",{"$nulls":9},{"$f":"IF($T$5=1,$S$39,IF($T$5=2,$S$38,IF($T$5=4,IF($M$9=\"\",$O$7,\"\"),IF(AND($T$5=3,$W$5=$R$5),Initial!$L$19,\"\"))))","v":{"v":0,"d":"0.00"}},{"$f":"IF($T$5=1,$S$37,IF($T$5=2,$S$36,IF($T$5=4,IF($M$9=\"\",$O$8,\"\"),IF(AND($T$5=3,$W$5=$R$5),Initial!$L$20,\"\"))))","v":{"v":0,"d":"0.00"}},false,{"v":-0.3981778275591398,"d":"-0.40"},{"$error":"#N/A"}]
[4,{"$nulls":5},"","",{"$nulls":9},{"$f":"IF($T$5=1,$S$39,IF($T$5=2,$S$38,IF($T$5=4,IF($M$9=\"\",$O$7,\"\"),IF(AND($T$5=3,$W$5=$R$5),Initial!$L$19,\"\"))))","v":{"v":0,"d":"0.00"}},{"$f":"IF($T$5=1,$S$37,IF($T$5=2,$S$36,IF($T$5=4,IF($M$9=\"\",$O$8,\"\"),IF(AND($T$5=3,$W$5=$R$5),Initial!$L$20,\"\"))))","v":{"v":0,"d":"0.00"}},false,{"v":-0.3981778275591398,"d":"-0.40"},{"$error":"#N/A"}]
[5,{"$nulls":5},"","",{"$nulls":9},{"$f":"IF($T$5=1,$S$39,IF($T$5=2,$S$38,IF($T$5=4,IF($M$9=\"\",$O$7,\"\"),IF(AND($T$5=3,$W$5=$R$5),Initial!$L$19,\"\"))))","v":{"v":0,"d":"0.00"}},{"$f":"IF($T$5=1,$S$37,IF($T$5=2,$S$36,IF($T$5=4,IF($M$9=\"\",$O$8,\"\"),IF(AND($T$5=3,$W$5=$R$5),Initial!$L$20,\"\"))))","v":{"v":0,"d":"0.00"}},false,{"v":-0.3981778275591398,"d":"-0.40"},{"$error":"#N/A"}]
[6,{"$nulls":5},"","",{"$nulls":9},{"$f":"IF($T$5=1,$S$39,IF($T$5=2,$S$38,IF($T$5=4,IF($M$9=\"\",$O$7,\"\"),IF(AND($T$5=3,$W$5=$R$5),Initial!$L$19,\"\"))))","v":{"v":0,"d":"0.00"}},{"$f":"IF($T$5=1,$S$37,IF($T$5=2,$S$36,IF($T$5=4,IF($M$9=\"\",$O$8,\"\"),IF(AND($T$5=3,$W$5=$R$5),Initial!$L$20,\"\"))))","v":{"v":0,"d":"0.00"}},false,{"v":-0.3981778275591398,"d":"-0.40"},{"$error":"#N/A"}]
[7,{"$nulls":5},"","",{"$nulls":9},{"$f":"IF($T$5=1,$S$39,IF($T$5=2,$S$38,IF($T$5=4,IF($M$9=\"\",$O$7,\"\"),IF(AND($T$5=3,$W$5=$R$5),Initial!$L$19,\"\"))))","v":{"v":0,"d":"0.00"}},{"$f":"IF($T$5=1,$S$37,IF($T$5=2,$S$36,IF($T$5=4,IF($M$9=\"\",$O$8,\"\"),IF(AND($T$5=3,$W$5=$R$5),Initial!$L$20,\"\"))))","v":{"v":0,"d":"0.00"}},false,{"v":-0.3981778275591398,"d":"-0.40"},{"$error":"#N/A"}]
[8,{"$nulls":5},"","",{"$nulls":9},{"$f":"IF($T$5=1,$S$39,IF($T$5=2,$S$38,IF($T$5=4,IF($M$9=\"\",$O$7,\"\"),IF(AND($T$5=3,$W$5=$R$5),Initial!$L$19,\"\"))))","v":{"v":0,"d":"0.00"}},{"$f":"IF($T$5=1,$S$37,IF($T$5=2,$S$36,IF($T$5=4,IF($M$9=\"\",$O$8,\"\"),IF(AND($T$5=3,$W$5=$R$5),Initial!$L$20,\"\"))))","v":{"v":0,"d":"0.00"}},false,{"v":-0.3981778275591398,"d":"-0.40"},{"$error":"#N/A"}]
[9,{"$nulls":5},"","",{"$nulls":9},{"$f":"IF($T$5=1,$S$39,IF($T$5=2,$S$38,IF($T$5=4,IF($M$9=\"\",$O$7,\"\"),IF(AND($T$5=3,$W$5=$R$5),Initial!$L$19,\"\"))))","v":{"v":0,"d":"0.00"}},{"$f":"IF($T$5=1,$S$37,IF($T$5=2,$S$36,IF($T$5=4,IF($M$9=\"\",$O$8,\"\"),IF(AND($T$5=3,$W$5=$R$5),Initial!$L$20,\"\"))))","v":{"v":0,"d":"0.00"}},false,{"v":-0.3981778275591398,"d":"-0.40"},{"$error":"#N/A"}]
[10,{"$nulls":5},"","",{"$nulls":9},{"$f":"IF($T$5=1,$S$39,IF($T$5=2,$S$38,IF($T$5=4,IF($M$9=\"\",$O$7,\"\"),IF(AND($T$5=3,$W$5=$R$5),Initial!$L$19,\"\"))))","v":{"v":0,"d":"0.00"}},{"$f":"IF($T$5=1,$S$37,IF($T$5=2,$S$36,IF($T$5=4,IF($M$9=\"\",$O$8,\"\"),IF(AND($T$5=3,$W$5=$R$5),Initial!$L$20,\"\"))))","v":{"v":0,"d":"0.00"}},false,{"v":-0.3981778275591398,"d":"-0.40"},{"$error":"#N/A"}]
[11,{"$nulls":5},"","",{"$nulls":9},{"$f":"IF($T$5=1,$S$39,IF($T$5=2,$S$38,IF($T$5=4,IF($M$9=\"\",$O$7,\"\"),IF(AND($T$5=3,$W$5=$R$5),Initial!$L$19,\"\"))))","v":{"v":0,"d":"0.00"}},{"$f":"IF($T$5=1,$S$37,IF($T$5=2,$S$36,IF($T$5=4,IF($M$9=\"\",$O$8,\"\"),IF(AND($T$5=3,$W$5=$R$5),Initial!$L$20,\"\"))))","v":{"v":0,"d":"0.00"}},false,{"v":-0.3981778275591398,"d":"-0.40"},{"$error":"#N/A"}]
[12,{"$nulls":5},"","",{"$nulls":9},{"$f":"IF($T$5=1,$S$39,IF($T$5=2,$S$38,IF($T$5=4,IF($M$9=\"\",$O$7,\"\"),IF(AND($T$5=3,$W$5=$R$5),Initial!$L$19,\"\"))))","v":{"v":0,"d":"0.00"}},{"$f":"IF($T$5=1,$S$37,IF($T$5=2,$S$36,IF($T$5=4,IF($M$9=\"\",$O$8,\"\"),IF(AND($T$5=3,$W$5=$R$5),Initial!$L$20,\"\"))))","v":{"v":0,"d":"0.00"}},false,{"v":-0.3981778275591398,"d":"-0.40"},{"$error":"#N/A"}]
[13,{"$nulls":5},"","",{"$nulls":9},{"$f":"IF($T$5=1,$S$39,IF($T$5=2,$S$38,IF($T$5=4,IF($M$9=\"\",$O$7,\"\"),IF(AND($T$5=3,$W$5=$R$5),Initial!$L$19,\"\"))))","v":{"v":0,"d":"0.00"}},{"$f":"IF($T$5=1,$S$37,IF($T$5=2,$S$36,IF($T$5=4,IF($M$9=\"\",$O$8,\"\"),IF(AND($T$5=3,$W$5=$R$5),Initial!$L$20,\"\"))))","v":{"v":0,"d":"0.00"}},false,{"v":-0.3981778275591398,"d":"-0.40"},{"$error":"#N/A"}]
[14,{"$nulls":5},"","",{"$nulls":9},{"$f":"IF($T$5=1,$S$39,IF($T$5=2,$S$38,IF($T$5=4,IF($M$9=\"\",$O$7,\"\"),IF(AND($T$5=3,$W$5=$R$5),Initial!$L$19,\"\"))))","v":{"v":0,"d":"0.00"}},{"$f":"IF($T$5=1,$S$37,IF($T$5=2,$S$36,IF($T$5=4,IF($M$9=\"\",$O$8,\"\"),IF(AND($T$5=3,$W$5=$R$5),Initial!$L$20,\"\"))))","v":{"v":0,"d":"0.00"}},false,{"v":-0.3981778275591398,"d":"-0.40"},{"$error":"#N/A"}]
[15,{"$nulls":5},"","",{"$nulls":9},{"$f":"IF($T$5=1,$S$39,IF($T$5=2,$S$38,IF($T$5=4,IF($M$9=\"\",$O$7,\"\"),IF(AND($T$5=3,$W$5=$R$5),Initial!$L$19,\"\"))))","v":{"v":0,"d":"0.00"}},{"$f":"IF($T$5=1,$S$37,IF($T$5=2,$S$36,IF($T$5=4,IF($M$9=\"\",$O$8,\"\"),IF(AND($T$5=3,$W$5=$R$5),Initial!$L$20,\"\"))))","v":{"v":0,"d":"0.00"}},false,{"v":-0.3981778275591398,"d":"-0.40"},{"$error":"#N/A"}]
[16,{"$nulls":5},"","",{"$nulls":9},{"$f":"IF($T$5=1,$S$39,IF($T$5=2,$S$38,IF($T$5=4,IF($M$9=\"\",$O$7,\"\"),IF(AND($T$5=3,$W$5=$R$5),Initial!$L$19,\"\"))))","v":{"v":0,"d":"0.00"}},{"$f":"IF($T$5=1,$S$37,IF($T$5=2,$S$36,IF($T$5=4,IF($M$9=\"\",$O$8,\"\"),IF(AND($T$5=3,$W$5=$R$5),Initial!$L$20,\"\"))))","v":{"v":0,"d":"0.00"}},false,{"v":-0.3981778275591398,"d":"-0.40"},{"$error":"#N/A"}]
[17,{"$nulls":5},"","",{"$nulls":9},{"$f":"IF($T$5=1,$S$39,IF($T$5=2,$S$38,IF($T$5=4,IF($M$9=\"\",$O$7,\"\"),IF(AND($T$5=3,$W$5=$R$5),Initial!$L$19,\"\"))))","v":{"v":0,"d":"0.00"}},{"$f":"IF($T$5=1,$S$37,IF($T$5=2,$S$36,IF($T$5=4,IF($M$9=\"\",$O$8,\"\"),IF(AND($T$5=3,$W$5=$R$5),Initial!$L$20,\"\"))))","v":{"v":0,"d":"0.00"}},false,{"v":-0.3981778275591398,"d":"-0.40"},{"$error":"#N/A"}]
[18,{"$nulls":5},"","",{"$nulls":9},{"$f":"IF($T$5=1,$S$39,IF($T$5=2,$S$38,IF($T$5=4,IF($M$9=\"\",$O$7,\"\"),IF(AND($T$5=3,$W$5=$R$5),Initial!$L$19,\"\"))))","v":{"v":0,"d":"0.00"}},{"$f":"IF($T$5=1,$S$37,IF($T$5=2,$S$36,IF($T$5=4,IF($M$9=\"\",$O$8,\"\"),IF(AND($T$5=3,$W$5=$R$5),Initial!$L$20,\"\"))))","v":{"v":0,"d":"0.00"}},false,{"v":-0.3981778275591398,"d":"-0.40"},{"$error":"#N/A"}]
[19,{"$nulls":5},"","",{"$nulls":9},{"$f":"IF($T$5=1,$S$39,IF($T$5=2,$S$38,IF($T$5=4,IF($M$9=\"\",$O$7,\"\"),IF(AND($T$5=3,$W$5=$R$5),Initial!$L$19,\"\"))))","v":{"v":0,"d":"0.00"}},{"$f":"IF($T$5=1,$S$37,IF($T$5=2,$S$36,IF($T$5=4,IF($M$9=\"\",$O$8,\"\"),IF(AND($T$5=3,$W$5=$R$5),Initial!$L$20,\"\"))))","v":{"v":0,"d":"0.00"}},false,{"v":-0.3981778275591398,"d":"-0.40"},{"$error":"#N/A"}]
[20,{"$nulls":5},"","",{"$nulls":9},{"$f":"IF($T$5=1,$S$39,IF($T$5=2,$S$38,IF($T$5=4,IF($M$9=\"\",$O$7,\"\"),IF(AND($T$5=3,$W$5=$R$5),Initial!$L$19,\"\"))))","v":{"v":0,"d":"0.00"}},{"$f":"IF($T$5=1,$S$37,IF($T$5=2,$S$36,IF($T$5=4,IF($M$9=\"\",$O$8,\"\"),IF(AND($T$5=3,$W$5=$R$5),Initial!$L$20,\"\"))))","v":{"v":0,"d":"0.00"}},false,{"v":-0.3981778275591398,"d":"-0.40"},{"$error":"#N/A"}]
[21,{"$nulls":5},"","",{"$nulls":9},{"$f":"IF($T$5=1,$S$39,IF($T$5=2,$S$38,IF($T$5=4,IF($M$9=\"\",$O$7,\"\"),IF(AND($T$5=3,$W$5=$R$5),Initial!$L$19,\"\"))))","v":{"v":0,"d":"0.00"}},{"$f":"IF($T$5=1,$S$37,IF($T$5=2,$S$36,IF($T$5=4,IF($M$9=\"\",$O$8,\"\"),IF(AND($T$5=3,$W$5=$R$5),Initial!$L$20,\"\"))))","v":{"v":0,"d":"0.00"}},false,{"v":-0.3981778275591398,"d":"-0.40"},{"$error":"#N/A"}]
[22,{"$nulls":5},"","",{"$nulls":9},{"$f":"IF($T$5=1,$S$39,IF($T$5=2,$S$38,IF($T$5=4,IF($M$9=\"\",$O$7,\"\"),IF(AND($T$5=3,$W$5=$R$5),Initial!$L$19,\"\"))))","v":{"v":0,"d":"0.00"}},{"$f":"IF($T$5=1,$S$37,IF($T$5=2,$S$36,IF($T$5=4,IF($M$9=\"\",$O$8,\"\"),IF(AND($T$5=3,$W$5=$R$5),Initial!$L$20,\"\"))))","v":{"v":0,"d":"0.00"}},false,{"v":-0.3981778275591398,"d":"-0.40"},{"$error":"#N/A"}]
[23,{"$nulls":5},"","",{"$nulls":9},{"$f":"IF($T$5=1,$S$39,IF($T$5=2,$S$38,IF($T$5=4,IF($M$9=\"\",$O$7,\"\"),IF(AND($T$5=3,$W$5=$R$5),Initial!$L$19,\"\"))))","v":{"v":0,"d":"0.00"}},{"$f":"IF($T$5=1,$S$37,IF($T$5=2,$S$36,IF($T$5=4,IF($M$9=\"\",$O$8,\"\"),IF(AND($T$5=3,$W$5=$R$5),Initial!$L$20,\"\"))))","v":{"v":0,"d":"0.00"}},false,{"v":-0.3981778275591398,"d":"-0.40"},{"$error":"#N/A"}]
[24,{"$nulls":5},"","",{"$nulls":9},{"$f":"IF($T$5=1,$S$39,IF($T$5=2,$S$38,IF($T$5=4,IF($M$9=\"\",$O$7,\"\"),IF(AND($T$5=3,$W$5=$R$5),Initial!$L$19,\"\"))))","v":{"v":0,"d":"0.00"}},{"$f":"IF($T$5=1,$S$37,IF($T$5=2,$S$36,IF($T$5=4,IF($M$9=\"\",$O$8,\"\"),IF(AND($T$5=3,$W$5=$R$5),Initial!$L$20,\"\"))))","v":{"v":0,"d":"0.00"}},false,{"v":-0.3981778275591398,"d":"-0.40"},{"$error":"#N/A"}]
[]
[null,{"$f":"Def!$B$67","v":"Data reviewed by (signature and date)"},{"$nulls":4},{"$f":"Def!$B$71","v":"Reviewer's Comments"}]

{"sheet":"Def","index":6,"n_rows":128,"n_cols":12,"rows_kept":128,"hidden":true,"merged":[[101,2,101,3],[102,1,103,1],[102,2,102,3],[102,4,102,5],[119,0,120,1],[122,1,124,1]]}
["Ort",null,"English","Deutsch","Français","Italiano","Español","Português","Русский (Russian)","中文 (Chinese)","日本語  (Japanese)","한국어  (Korean)"]
[]
[null,{"$f":"INDEX(commDef,,Initial!$P$2)","v":"Measurement Report"},"Measurement Report","Messprotokoll","Rapport de mesure","Registro delle misure","Informe de medición","Registro de Medição","Протокол измерения","测试记录表","測定記録","측정 기록"]
[null,{"$f":"INDEX(commDef,,Initial!$P$2)","v":"Initial data"},"Initial data","Initial data","Initial data","Initial data","Initial data","Initial data","Initial data","Initial data","Initial data","Initial data"]
[null,{"$f":"INDEX(commDef,,Initial!$P$2)","v":"Report"},"Report","Protokoll","Rapport","Registro","Informe","Registro","Протокол","记录","レポート","기록"]
[null,{"$f":"INDEX(commDef,,Initial!$P$2)","v":"Performance test for Moisture Analyzer"},"Performance test for Moisture Analyzer","Funktionstest für Moisture Analyzer","Test de performance pour le dessiccateur","Test per analizzatore di umidità","Test de rendimiento para analizador de humedad","Teste de esempenho para o analisador de umidade","Проверка анализатора влажности","卤素水分测定仪性能测试","水分計の性能検査","수분분석기 성능시험"]
[]
[]
[null,{"$f":"INDEX(commDef,,Initial!$P$2)","v":"Test temperature"},"Test temperature","Testtemperatur","Test de température","Temperatura test","Test de temperatura","Temperatura de teste","Температура проверки","测试温度 ","検査温度","시험 온도"]
[null,{"$f":"INDEX(commDef,,Initial!$P$2)","v":"Instrument identification"},"Instrument identification","Instrumentidentifizierung","Identification instrument","Identificazione strumento","Identificación del instrumento","Identificação do instrumento","Идентификация прибора","产品标识","製品仕様","제품 식별"]
[null,{"$f":"INDEX(commDef,,Initial!$P$2)","v":"Company"},"Company","Firma","Société","Ditta","Empresa","Empresa","Компания","公司","会社名","회사"]
[null,{"$f":"INDEX(commDef,,Initial!$P$2)","v":"Instrument type"},"Instrument type","Instrument","Type d'instrument","Tipo di strumento","Tipo de instrumento","Tipo de instrumento","Тип прибора","仪器型号","製品型式","기기 종류"]
[null,{"$f":"INDEX(commDef,,Initial!$P$2)","v":"Instrument ID"},"Instrument ID","Instrument ID","ID instrument","ID strumento","ID de instrumento","ID do instrumento","ID прибора","仪器标识","製品ID","기기 ID"]
[null,{"$f":"INDEX(commDef,,Initial!$P$2)","v":"Location"},"Location","Einsatzort","Emplacement","Localizzazione","Ubicación","Localização","локация","位置","住所","위치"]
[null,{"$f":"INDEX(commDef,,Initial!$P$2)","v":"Contact Person"},"Contact Person","Kontaktperson","Personne à contacter","Contatto","Persona de contacto","Pessoa de contato","Контактное лицо","联系人","担当者","담당자"]
[null,{"$f":"INDEX(commDef,,Initial!$P$2)","v":"Testing parameter"},"Testing parameter","Testparameter","L'analyse des paramètres","Parametri test","Parámetro de prueba","Parâmetros do teste","Тестируемый параметр","测试参数","検査パラメーター","시험 파라미터"]
[null,{"$f":"INDEX(commDef,,Initial!$P$2)","v":"Switch-off criterion"},"Switch-off criterion","Abschaltkriterium","Critère d'arrêt","Criterio di disinserzione","Criterio de desconexión","Criterio de desconexão","Критерий остановки","关机模式","スイッチオフ基準","가열 중지 기준"]
[null,{"$f":"INDEX(commDef,,Initial!$P$2)","v":"Time (10 min)"},"Time (10 min)","Zeit (10 min)","Temps (10 min)","Tempo (10 min)","Tiempo (10 min)","Tempo (10 min)","Время (10мин)","定时 (10分钟)","時間（10分）","시간 (10 분)"]
[null,{"$f":"INDEX(commDef,,Initial!$P$2)","v":"Drying program"},"Drying program","Trocknungsprogramm","Progr. de dessiccation","Progr. essiccamento","Programa de secado","Programa de secagem","Программа сушки","升温程序","乾燥プログラム","건조프로그램"]
[null,{"$f":"INDEX(commDef,,Initial!$P$2)","v":"Standard"},"Standard","Standard","Standard","Standard","Estándar","Padrão","Стандартная","标准","標準","표준 "]
[null,{"$f":"INDEX(commDef,,Initial!$P$2)","v":"Display mode"},"Display mode","Anzeige","Affichage","Tipo di indicazione","Modo pantalla","Exibiçao display","Режим отображения","结果显示模式","表示モード","디스플레이모드"]
[null,{"$f":"INDEX(commDef,,Initial!$P$2)","v":"Perform test with cold instrument."},"Perform test with cold instrument.","Test mit abgekühltem Gerät durchführen.","Faire un test avec l'instrument à froid.","Eseguire il test a freddo con lo strumento.","Test de rendimiento con instrumento frío.","Realização de ensaio com instrumento frio.","Выполнение проверки с холодным прибором.","冷机下的性能测试.","冷却された機器で検査を行う.","냉각된 기기에서 시험을 하십시오."]
[null,{"$f":"INDEX(commDef,,Initial!$P$2)","v":"MT Control Limits"},"MT Control Limits","MT Kontrollgrenzen","MT limites de contrôle","MT limiti di controllo","Límites de control MT","Limites de controle MT","Пределы регулирования MT","MT 控制极限值","MT 管理限界値","MT 제어한계값"]
[null,{"$f":"INDEX(commDef,,Initial!$P$2)","v":"MT Control Limits [%MC]"},"MT Control Limits [%MC]","MT Kontrollgrenzen [%MC]","MT limites de contrôle [%MC]","MT limiti di controllo [%MC]","Límites de control MT [%MC]","Limites de controle MT [%MC]","Пределы регулирования MT [%MC]","MT 控制极限值 [%MC]","MT 管理限界値 [%MC]","MT 제어한계값 [%MC]"]
[null,{"$f":"INDEX(commDef,,Initial!$P$2)","v":"Lower Limit"},"Lower Limit","Unteres Limit","Limites inférieures","Limite inferiore  ","Límite inferior","Limite inferior","Нижний предел","下限","低許容値","하한값"]
[null,{"$f":"INDEX(commDef,,Initial!$P$2)","v":"Upper Limit"},"Upper Limit","Oberes Limit","Limites supérieures","Limite superiore","Límite superior","Limite superior","Верхний предел","上限","高許容値","상한값"]
[null,{"$f":"INDEX(commDef,,Initial!$P$2)","v":"SmartCal Test at"},"SmartCal Test at","Funktionstest bei","Test de performance à","Verifica delle prestazioni a","Test de rendimiento a",{"$f":"\"Teste de desempenho a \" & TempSel","v":{"$error":"#REF!"}},"Выполнение теста при","时的性能测试","での性能検査","에서 성능시험"]
[null,{"$f":"INDEX(commDef,,Initial!$P$2)","v":"Test Results"},"Test Results","Testergebnisse","Résultats des tests","Risultati del test","Test de resultado","Resultados do teste","Результаты испытания","测试结果","検査結果","시험 결과"]
[null,{"$f":"INDEX(commDef,,Initial!$P$2)","v":"Test Results %MCN"},"Test Results %MCN","Testergebnisse %MCN","Résultats des Tests, %MCN","Risultati del test, %MCN","Test de resultado, %MCN","Resultados do teste, %MCN","Результаты испытания, %MCN","测试结果 %MCN","検査結果, %MCN","시험 결과 %MCN"]
[null,{"$f":"INDEX(commDef,,Initial!$P$2)","v":"Measurement"},"Measurement","Messung","Mesure","Misura","Medición","Medição","Измерение","测试","測定","측정"]
[null,{"$f":"INDEX(commDef,,Initial!$P$2)","v":"Date"},"Date","Datum","Date","Data","Fecha","Data","Дата","日期","日付","날짜"]
[null,{"$f":"INDEX(commDef,,Initial!$P$2)","v":"Time"},"Time","Zeit","Temps","Ora","Hora","Hora","Время ","时间","時間","시간"]
[null,{"$f":"INDEX(commDef,,Initial!$P$2)","v":"Environmental conditions"},"Environmental conditions","Umgebungsbedingungen","Conditions ambiantes","Condizioni ambientali","Condiciones ambientales","Condições ambientais","Условия окружающей среды","环境条件","周辺環境","환경조건"]
[null,{"$f":"INDEX(commDef,,Initial!$P$2)","v":"%RH"},"%RH",{"$f":"$C34","v":"%RH"},"%RH","%RH","%RH","%RH","%RH","相对湿度 (%RH)",{"$f":"$C34","v":"%RH"},"%RH"]
[null,{"$f":"INDEX(commDef,,Initial!$P$2)","v":"°C"},"°C","°C","°C","°C","°C","°C","°C",{"$f":"$C35","v":"°C"},"°C","°C"]
[null,{"$f":"INDEX(commDef,,Initial!$P$2)","v":"%MC"},"%MC","%MC","%MC","%MC","%MC","%MC","%MC",{"$f":"$C36","v":"%MC"},"%MC","%MC"]
[null,{"$f":"INDEX(commDef,,Initial!$P$2)","v":"%MCN"},"%MCN","%MCN","%MCN","%MCN","%MCN","%MCN","%MCN",{"$f":"$C37","v":"%MCN"},"%MCN","%MCN"]
[null,{"$f":"INDEX(commDef,,Initial!$P$2)","v":"Within Limits"},"Within Limits","Innerhalb Limite","Dans les limites","Entro i limiti","Dentro de los límites","Dentro dos limites","В пределах","合格","許容値内","허용범위 이내"]
[null,{"$f":"INDEX(commDef,,Initial!$P$2)","v":"Yes"},"Yes","Ja","Oui","Si","Sí","Sim","Да","是","Yes","예"]
[null,{"$f":"INDEX(commDef,,Initial!$P$2)","v":"No"},"No","Nein","Non","No","No","Não","Нет","否","No","아니오"]
[null,{"$f":"INDEX(commDef,,Initial!$P$2)","v":"N/A"},"N/A",{"$f":"$C41","v":"N/A"},"N/A","N/A","N/A","N/A","N/A","N/A","N/A","N/A"]
[null,{"$f":"INDEX(commDef,,Initial!$P$2)","v":"Remarks"},"Remarks","Bemerkungen","Remarques","Commenti","Comentarios","Observações","Примечания","备注","備考","비고"]
[null,{"$f":"INDEX(commDef,,Initial!$P$2)","v":"e.g. Package damaged, adjustment done etc."},"e.g. Package damaged, adjustment done etc.","z.B. Verpackung beschädigt, Justierung durchgeführt usw.","p. ex.: colis endommagé, réglage effectué etc.","Es. Imballo danneggiato, regolazione eseguita ecc.","por ejemplo: Paquetes dañados, ajustes realizados etc.","Por exemplo: pacote danificado, ajuste feito, etc.","Например, повреждена упаковка, проведена настройка и т.д.","例如：包装损坏、执行校正等","例）パッケージが破損している、調整済み、など","예. 포장 파손, 조정 완료 등."]
[null,{"$f":"INDEX(commDef,,Initial!$P$2)","v":"Name"},"Name","Name","Nom","Nome","Nombre","Nome","Наименование","姓名","名前","이름"]
[null,{"$f":"INDEX(commDef,,Initial!$P$2)","v":"Instrument specific limits"},"Instrument specific limits","Instrumentspezifische Grenzen","Limites spécifiques de l'instrument","Limiti specifici per lo strumento","Límites específicos del instrumento","Limites específicos do instrumento","Индивидуальные пределы приборы","仪器规格极限值","機器固有の限界値","기기의 특정 한계값"]
[null,{"$f":"INDEX(commDef,,Initial!$P$2)","v":"Instrument specific limits [%MC]"},"Instrument specific limits [%MC]","Instrumentspezifische Grenzen [MC%]","Limites spécifiques de l'instrument [%MC]","Limiti specifici per lo strumento [%MC]","Límites específicos del instrumento [%MC]","Limites específicos do instrumento [%MC]","Индивидуальные пределы приборы [%MC]","仪器规格极限值 [%MC]","機器固有の限界値 [%MC]","기기의 특정 한계값 [%MC]"]
[]
[null,{"$f":"INDEX(commDef,,Initial!$P$2)","v":"Mean [%MCN]"},"Mean [%MCN]","Mittelwert [%MCN]","Moyenne [%MCN]","Media [%MCN]","Media [%MCN]","Média [%MCN]","Среднее [%MCN]","平均值 [%MCN]","平均値 [%MCN]","평균 [%MCN]"]
[null,{"$f":"INDEX(commDef,,Initial!$P$2)","v":"SD"},"SD","SD (Standardabweichung)","SD (déviation standard)","SD (Deviazione standard)","SD (desviación estándar)","SD (desvio padrão)","SD (стандартное отклонение)","标准偏差(SD)","SD（標準偏差）","표준편차"]
[]
[null,{"$f":"INDEX(commDef,,Initial!$P$2)","v":"other"},"other","andere","autre","altri","otra","outra","другая","其他","他の","다른"]
[]
[]
[null,{"$f":"INDEX(commDef,,Initial!$P$2)","v":"MT Control Limits (certified)"},"MT Control Limits (certified)","MT Kontrollgrenzen (certified)","MT limites de contrôle (certified)","MT limiti di controllo (certified)","Límites de control MT (certified)","Limites de controle MT (certified)","Пределы MT (certified)","MT 控制极限值 (certified)","MT 管理限界値 (certified)","MT 제어한계값 (certified)"]
[null,{"$f":"INDEX(commDef,,Initial!$P$2)","v":"MT Control Limits (standard)"},"MT Control Limits (standard)","MT Kontrollgrenzen (standard)","MT limites de contrôle (standard)","MT limiti di controllo (standard)","Límites de control MT (standard)","Limites de controle MT (standard)","Пределы MT (standard)","MT 控制极限值 (standard)","MT 管理限界値 (standard)","MT 제어한계값 (standard)"]
[null,{"$f":"INDEX(commDef,,Initial!$P$2)","v":"- - - - - -"},"- - - - - -","- - - - - -","- - - - - -","- - - - - -","- - - - - -","- - - - - -","- - - - - -","- - - - - -","- - - - - -","- - - - - -"]
[null,{"$f":"INDEX(commDef,,Initial!$P$2)","v":"Manual input limits"},"Manual input limits","Manuelle Eingabe der Limits","Limites saisies manuellement","Limiti inseriti manualmente","Manual de entrada de límites","Limites de entrada manual","Ручной ввод пределов","手動輸入限制","任意管理値入力","수동 입력 한계"]
[null,{"$f":"INDEX(commDef,,Initial!$P$2)","v":"Set Date / Time"},"Set Date / Time","Datum / Zeit ","Date / Temps","Data / Ora","Fecha / Ora","Data / Hora","Дата / Время ","日期 / 时间","日付 / 時間","날짜 / 시간"]
[null,{"$f":"INDEX(commDef,,Initial!$P$2)","v":"= Mean -  * SD"},{"$f":"\"= Mean - \" & Initial!$L$18 & \" * SD\"","v":"= Mean -  * SD"},{"$f":"$C59","v":"= Mean -  * SD"},"= Mean -  * SD","= Mean -  * SD","= Mean -  * SD","= Mean -  * SD","= Mean -  * SD","= Mean -  * SD","= Mean -  * SD","= Mean -  * SD"]
[null,{"$f":"INDEX(commDef,,Initial!$P$2)","v":"= Mean +  * SD"},{"$f":"\"= Mean + \" & Initial!$L$18 & \" * SD\"","v":"= Mean +  * SD"},"= Mean +  * SD","= Mean +  * SD","= Mean +  * SD","= Mean +  * SD","= Mean +  * SD","= Mean +  * SD","= Mean +  * SD","= Mean +  * SD","= Mean +  * SD"]
[]
[null,{"$f":"INDEX(commDef,,Initial!$P$2)","v":"Missing entry"},"Missing entry","Fehlender Eintrag","Entrée manquante","Dato mancante","Entrada Ausente","Entrada Ausente","Отсутствует запись","未输入","間違った入力","누락 항목"]
[null,{"$f":"INDEX(commDef,,Initial!$P$2)","v":"Certified"},"Certified",{"$f":"$C63","v":"Certified"},"Certified","Certified","Certified","Certified","Certified","Certified","Certified","Certified"]
[null,{"$f":"INDEX(commDef,,Initial!$P$2)","v":"Manual Input"},"Manual Input","Manuelle Eingabe","Saisie manuelle","Input manuale","Entrada Manual ","Entrada Manual","Ввод пользователем","手动输入","手入力","수동 입력"]
[null,{"$f":"INDEX(commDef,,Initial!$P$2)","v":"- - - - - -"},"- - - - - -","- - - - - -","- - - - - -","- - - - - -","- - - - - -","- - - - - -","- - - - - -","- - - - - -","- - - - - -","- - - - - -"]
[null,{"$f":"INDEX(commDef,,Initial!$P$2)","v":"Data entered by: (signature and date)"},"Data entered by: (signature and date)","Daten eingetragen von: (Unterschrift und Datum)","Données entrées par: (date et signature)","Dati inseriti da: (data e firma)","Datos introducidos por: (firma y fecha)","Dados inseridos por: (assinatura e data) ","Данные введены: (подпись и дата)","数据记录者：(签名及日期)","入力者：","데이터 입력자: (서명 및 날짜)"]
[null,{"$f":"INDEX(commDef,,Initial!$P$2)","v":"Data reviewed by (signature and date)"},"Data reviewed by (signature and date)","Daten geprüft von: (Unterschrift und Datum)","Données examinées par: (date et signature)","Dati revisionati da: (data e firma)","Datos revisados por: (firma y fecha)","Dados revistos por: (assinatura e data) ","Данные проверены: (подпись и дата)","数据检查者：(签名及日期)","管理者:","데이터 검토자: (서명 및 날짜)"]
[null,{"$f":"INDEX(commDef,,Initial!$P$2)","v":"Version 2.10   2012-03"},"Version 2.10   2012-03",{"$f":"$C68","v":"Version 2.10   2012-03"},{"$f":"$C68","v":"Version 2.10   2012-03"},"Version 2.10   2012-03","Version 2.10   2012-03","Version 2.10   2012-03","Version 2.10   2012-03","Version 2.10   2012-03","Version 2.10   2012-03","Version 2.10   2012-03"]
[null,{"$f":"INDEX(commDef,,Initial!$P$2)","v":"Select"},"Select","Auswählen","Sélectionnez","Seleziona","Seleccionar","Selecionar","Выбрать","选择","選択する","선택"]
[null,{"$f":"INDEX(commDef,,Initial!$P$2)","v":"SmartCal Lot No."},"SmartCal Lot No.",{"$f":"$C70","v":"SmartCal Lot No."},"SmartCal Lot No.","SmartCal Lot No.","SmartCal Lot No.","SmartCal Lot No.","SmartCal Lot No.","SmartCal 标识号",{"$f":"$C70","v":"SmartCal Lot No."},{"$f":"$C70","v":"SmartCal Lot No."}]
[null,{"$f":"INDEX(commDef,,Initial!$P$2)","v":"Reviewer's Comments"},"Reviewer's Comments","Kommentare des Reviewers","Commentaires du contrôleur","Commenti del revisore","Comentarios del Revisor","Comentários do Revisor","Примечания к проверке","检查者注释","管理者コメント","검토자의 댓글"]
[null,{"$f":"INDEX(commDef,,Initial!$P$2)","v":"Comments"},"Comments","Kommentare","Commentaires ","Commenti","Comentarios","Comentários","Примечания","注释","コメント","댓글"]
[null,{"$f":"INDEX(commDef,,Initial!$P$2)","v":"Remove manual limits before changing selection."},"Remove manual limits before changing selection.","Die manuellen Limite vor der Selektion entfernen.","Retirer les limites manuelles avant de changer de sélection ","Rimuovere manualmente i limiti prima di modificare la selezione.","Eliminar los límites manuales antes de cambiar la selección.","Remova os limites manuais antes de alterar a seleção.","Удаление пользовательских значений перед изменением выбираемых пределов","修改选项前请删除手动输入的极限值。","マニュアル入力値を削除する","선택을 변경하기 전에 수동 한계를 제거하시오"]
[null,{"$f":"INDEX(commDef,,Initial!$P$2)","v":"Upper limit must be greater than lower limit!"},"Upper limit must be greater than lower limit!","Oberes Limit muss grösser sein als unteres Limit!","La limite supérieure doit être plus grande que la limite inférieure!","I limiti superiori devono essere maggiori dei limiti inferiori!","El límite superior debe ser mayor que el límite inferior","O limite máximo deve ser maior do que o limite inferior!","Верхний предел должен быть больше нижнего","极限值上限必须大于极限值下限！","上限値の値は下限値よりも大きい必要があります","상한은 반드시 하한보다 커야 합니다."]
{"$rows_empty":25}
["Process Definitions"]
[]
[]
[null,"Temperature","Upper Calibration Limit",null,"Lower Calibration Limit"]
[null,null,"standard","certified","standard","certified"]
[null,"70°C",4.4,4.3,3.2,3.3]
[null,"100°C",6.4,6.3,5.2,5.3]
[null,"130°C",8.8,8.7,7.4,7.5]
[null,"160°C",11.7,11.6,9.9,{"v":10,"d":"10.0"}]
[null,{"$f":"$C$51","v":"other"},"-----","-----","-----","-----"]
{"$rows_empty":10}
["Equation parameters"]
[]
[8.6204335908019,"mass of water vapour at 20°C, 50%RH"]
[611.2,")  From Magnus formula for -45°C ≤ t ≤ 60°C \n)  to calculate saturation vapour pressure [Pa]"]
[17.62]
[243.12]
[461.52,"J.kg-1°K-1  (individual gas constant of water)"]
[273.15,"Conversion from °C to °K"]
[-0.04619,"Gradient (α)"]